Ubuntu14.04安装Mesos出现错误

猪迪 发布于 2016/03/23 22:04
阅读 598
收藏 0

错误信息如下:

cloud@xulunfan:~/mesos/build$ ../configure

cloud@xulunfan:~/mesos/build$ make 

cloud@xulunfan:~/mesos/build$ make  check

*** Check failure stack trace: ***
make[5]: *** [check-local] Aborted (core dumped)
make[5]: Leaving directory `/home/cloud/mesos/build/3rdparty/libprocess'
make[4]: *** [check-am] Error 2
make[4]: Leaving directory `/home/cloud/mesos/build/3rdparty/libprocess'
make[3]: *** [check-recursive] Error 1
make[3]: Leaving directory `/home/cloud/mesos/build/3rdparty/libprocess'
make[2]: *** [check-recursive] Error 1
make[2]: Leaving directory `/home/cloud/mesos/build/3rdparty'
make[1]: *** [check] Error 2
make[1]: Leaving directory `/home/cloud/mesos/build/3rdparty'
make: *** [check-recursive] Error 1

cloud@xulunfan:~/mesos/build$ make  install
Making install in .
make[1]: Entering directory `/home/cloud/mesos/build'
make[2]: Entering directory `/home/cloud/mesos/build'
make[2]: Nothing to be done for `install-exec-am'.
 /bin/mkdir -p '/usr/local/lib/pkgconfig'
/bin/mkdir: cannot create directory `/usr/local/lib/pkgconfig': Permission denied
make[2]: *** [install-pkgconfigDATA] Error 1
make[2]: Leaving directory `/home/cloud/mesos/build'
make[1]: *** [install-am] Error 2
make[1]: Leaving directory `/home/cloud/mesos/build'
make: *** [install-recursive] Error 1




加载中
返回顶部
顶部