android客户端源码启动报1266个错,求大神解决

tormentyoung 发布于 2016/10/16 22:14
阅读 274
收藏 0
Information:Gradle tasks [:app:clean, :app:generateGoogleDebugSources, :app:generateGoogleDebugAndroidTestSources, :app:prepareGoogleDebugUnitTestDependencies, :app:mockableAndroidJar, :app:assembleGoogleDebug]
Error⚠ Ignoring InnerClasses attribute for an anonymous inner class
Error:(com.umeng.socialize.bean.aa) that doesn't come with an
Error:associated EnclosingMethod attribute. This class was probably produced by a
Error:compiler that did not target the modern .class file format. The recommended
Error:solution is to recompile the class from source, using an up-to-date compiler
Error:and without specifying any "-target" type options. The consequence of ignoring
Error:this warning is that reflective operations on this class will incorrectly
Error:indicate that it is *not* an inner class.
Error⚠ Ignoring InnerClasses attribute for an anonymous inner class
Error:(com.umeng.socialize.bean.ab) that doesn't come with an
Error:associated EnclosingMethod attribute. This class was probably produced by a
Error:compiler that did not target the modern .class file format. The recommended
Error:solution is to recompile the class from source, using an up-to-date compiler
Error:and without specifying any "-target" type options. The consequence of ignoring
Error:this warning is that reflective operations on this class will incorrectly
Error:indicate that it is *not* an inner class.
Error⚠ Ignoring InnerClasses attribute for an anonymous inner class
Error:(com.umeng.socialize.bean.ac) that doesn't come with an
Error:associated EnclosingMethod attribute. This class was probably produced by a
Error:compiler that did not target the modern .class file format. The recommended
Error:solution is to recompile the class from source, using an up-to-date compiler
Error:and without specifying any "-target" type options. The consequence of ignoring
Error:this warning is that reflective operations on this class will incorrectly
Error:indicate that it is *not* an inner class.
Error⚠ Ignoring InnerClasses attribute for an anonymous inner class
Error:(com.umeng.socialize.bean.ad) that doesn't come with an
Error:associated EnclosingMethod attribute. This class was probably produced by a
Error:compiler that did not target the modern .class file format. The recommended
Error:solution is to recompile the class from source, using an up-to-date compiler
Error:and without specifying any "-target" type options. The consequence of ignoring
Error:this warning is that reflective operations on this class will incorrectly
Error:indicate that it is *not* an inner class.
Error⚠ Ignoring InnerClasses attribute for an anonymous inner class
Error:(com.umeng.socialize.bean.ag) that doesn't come with an
Error:associated EnclosingMethod attribute. This class was probably produced by a
Error:compiler that did not target the modern .class file format. The recommended
Error:solution is to recompile the class from source, using an up-to-date compiler
Error:and without specifying any "-target" type options. The consequence of ignoring
Error:this warning is that reflective operations on this class will incorrectly
Error:indicate that it is *not* an inner class.
Error⚠ Ignoring InnerClasses attribute for an anonymous inner class
Error:(com.umeng.socialize.bean.ah) that doesn't come with an
Error:associated EnclosingMethod attribute. This class was probably produced by a
Error:compiler that did not target the modern .class file format. The recommended
Error:solution is to recompile the class from source, using an up-to-date compiler
Error:and without specifying any "-target" type options. The consequence of ignoring
Error:this warning is that reflective operations on this class will incorrectly
Error:indicate that it is *not* an inner class.
Error⚠ Ignoring InnerClasses attribute for an anonymous inner class
Error:(com.umeng.socialize.bean.aj) that doesn't come with an
Error:associated EnclosingMethod attribute. This class was probably produced by a
Error:compiler that did not target the modern .class file format. The recommended
Error:solution is to recompile the class from source, using an up-to-date compiler
Error:and without specifying any "-target" type options. The consequence of ignoring
Error:this warning is that reflective operations on this class will incorrectly
Error:indicate that it is *not* an inner class.
Error⚠ Ignoring InnerClasses attribute for an anonymous inner class
Error:(com.umeng.socialize.bean.ak) that doesn't come with an
Error:associated EnclosingMethod attribute. This class was probably produced by a
Error:compiler that did not target the modern .class file format. The recommended
Error:solution is to recompile the class from source, using an up-to-date compiler
Error:and without specifying any "-target" type options. The consequence of ignoring
Error:this warning is that reflective operations on this class will incorrectly
Error:indicate that it is *not* an inner class.
Error⚠ Ignoring InnerClasses attribute for an anonymous inner class
Error:(com.umeng.socialize.bean.am) that doesn't come with an
Error:associated EnclosingMethod attribute. This class was probably produced by a
Error:compiler that did not target the modern .class file format. The recommended
Error:solution is to recompile the class from source, using an up-to-date compiler
Error:and without specifying any "-target" type options. The consequence of ignoring
Error:this warning is that reflective operations on this class will incorrectly
Error:indicate that it is *not* an inner class.
Error⚠ Ignoring InnerClasses attribute for an anonymous inner class
Error:(com.umeng.socialize.bean.an) that doesn't come with an
Error:associated EnclosingMethod attribute. This class was probably produced by a
Error:compiler that did not target the modern .class file format. The recommended
Error:solution is to recompile the class from source, using an up-to-date compiler
Error:and without specifying any "-target" type options. The consequence of ignoring
Error:this warning is that reflective operations on this class will incorrectly
Error:indicate that it is *not* an inner class.
Error⚠ Ignoring InnerClasses attribute for an anonymous inner class
Error:(com.umeng.socialize.bean.ao) that doesn't come with an
Error:associated EnclosingMethod attribute. This class was probably produced by a
Error:compiler that did not target the modern .class file format. The recommended
Error:solution is to recompile the class from source, using an up-to-date compiler
Error:and without specifying any "-target" type options. The consequence of ignoring
Error:this warning is that reflective operations on this class will incorrectly
Error:indicate that it is *not* an inner class.
Error⚠ Ignoring InnerClasses attribute for an anonymous inner class
Error:(com.umeng.socialize.bean.ap) that doesn't come with an
Error:associated EnclosingMethod attribute. This class was probably produced by a
Error:compiler that did not target the modern .class file format. The recommended
Error:solution is to recompile the class from source, using an up-to-date compiler
Error:and without specifying any "-target" type options. The consequence of ignoring
Error:this warning is that reflective operations on this class will incorrectly
Error:indicate that it is *not* an inner class.
Error⚠ Ignoring InnerClasses attribute for an anonymous inner class
Error:(com.umeng.socialize.bean.e) that doesn't come with an
Error:associated EnclosingMethod attribute. This class was probably produced by a
Error:compiler that did not target the modern .class file format. The recommended
Error:solution is to recompile the class from source, using an up-to-date compiler
Error:and without specifying any "-target" type options. The consequence of ignoring
Error:this warning is that reflective operations on this class will incorrectly
Error:indicate that it is *not* an inner class.
Error⚠ Ignoring InnerClasses attribute for an anonymous inner class
Error:(com.umeng.socialize.bean.f) that doesn't come with an
Error:associated EnclosingMethod attribute. This class was probably produced by a
Error:compiler that did not target the modern .class file format. The recommended
Error:solution is to recompile the class from source, using an up-to-date compiler
Error:and without specifying any "-target" type options. The consequence of ignoring
Error:this warning is that reflective operations on this class will incorrectly
Error:indicate that it is *not* an inner class.
Error⚠ Ignoring InnerClasses attribute for an anonymous inner class
Error:(com.umeng.socialize.bean.g) that doesn't come with an
Error:associated EnclosingMethod attribute. This class was probably produced by a
Error:compiler that did not target the modern .class file format. The recommended
Error:solution is to recompile the class from source, using an up-to-date compiler
Error:and without specifying any "-target" type options. The consequence of ignoring
Error:this warning is that reflective operations on this class will incorrectly
Error:indicate that it is *not* an inner class.
Error⚠ Ignoring InnerClasses attribute for an anonymous inner class
Error:(com.umeng.socialize.bean.h) that doesn't come with an
Error:associated EnclosingMethod attribute. This class was probably produced by a
Error:compiler that did not target the modern .class file format. The recommended
Error:solution is to recompile the class from source, using an up-to-date compiler
Error:and without specifying any "-target" type options. The consequence of ignoring
Error:this warning is that reflective operations on this class will incorrectly
Error:indicate that it is *not* an inner class.
Error⚠ Ignoring InnerClasses attribute for an anonymous inner class
Error:(com.umeng.socialize.bean.a) that doesn't come with an
Error:associated EnclosingMethod attribute. This class was probably produced by a
Error:compiler that did not target the modern .class file format. The recommended
Error:solution is to recompile the class from source, using an up-to-date compiler
Error:and without specifying any "-target" type options. The consequence of ignoring
Error:this warning is that reflective operations on this class will incorrectly
Error:indicate that it is *not* an inner class.
Error⚠ Ignoring InnerClasses attribute for an anonymous inner class
Error:(com.umeng.socialize.bean.ae) that doesn't come with an
Error:associated EnclosingMethod attribute. This class was probably produced by a
Error:compiler that did not target the modern .class file format. The recommended
Error:solution is to recompile the class from source, using an up-to-date compiler
Error:and without specifying any "-target" type options. The consequence of ignoring
Error:this warning is that reflective operations on this class will incorrectly
Error:indicate that it is *not* an inner class.
Error⚠ Ignoring InnerClasses attribute for an anonymous inner class
Error:(com.umeng.socialize.bean.af) that doesn't come with an
Error:associated EnclosingMethod attribute. This class was probably produced by a
Error:compiler that did not target the modern .class file format. The recommended
Error:solution is to recompile the class from source, using an up-to-date compiler
Error:and without specifying any "-target" type options. The consequence of ignoring
Error:this warning is that reflective operations on this class will incorrectly
Error:indicate that it is *not* an inner class.
Error⚠ Ignoring InnerClasses attribute for an anonymous inner class
Error:(com.umeng.socialize.bean.ai) that doesn't come with an
Error:associated EnclosingMethod attribute. This class was probably produced by a
Error:compiler that did not target the modern .class file format. The recommended
Error:solution is to recompile the class from source, using an up-to-date compiler
Error:and without specifying any "-target" type options. The consequence of ignoring
Error:this warning is that reflective operations on this class will incorrectly
Error:indicate that it is *not* an inner class.
Error⚠ Ignoring InnerClasses attribute for an anonymous inner class
Error:(com.umeng.socialize.bean.al) that doesn't come with an
Error:associated EnclosingMethod attribute. This class was probably produced by a
Error:compiler that did not target the modern .class file format. The recommended
Error:solution is to recompile the class from source, using an up-to-date compiler
Error:and without specifying any "-target" type options. The consequence of ignoring
Error:this warning is that reflective operations on this class will incorrectly
Error:indicate that it is *not* an inner class.
Error⚠ Ignoring InnerClasses attribute for an anonymous inner class
Error:(com.umeng.socialize.bean.b) that doesn't come with an
Error:associated EnclosingMethod attribute. This class was probably produced by a
Error:compiler that did not target the modern .class file format. The recommended
Error:solution is to recompile the class from source, using an up-to-date compiler
Error:and without specifying any "-target" type options. The consequence of ignoring
Error:this warning is that reflective operations on this class will incorrectly
Error:indicate that it is *not* an inner class.
Error⚠ Ignoring InnerClasses attribute for an anonymous inner class
Error:(com.umeng.socialize.bean.c) that doesn't come with an
Error:associated EnclosingMethod attribute. This class was probably produced by a
Error:compiler that did not target the modern .class file format. The recommended
Error:solution is to recompile the class from source, using an up-to-date compiler
Error:and without specifying any "-target" type options. The consequence of ignoring
Error:this warning is that reflective operations on this class will incorrectly
Error:indicate that it is *not* an inner class.
Error⚠ Ignoring InnerClasses attribute for an anonymous inner class
Error:(com.umeng.socialize.bean.i) that doesn't come with an
Error:associated EnclosingMethod attribute. This class was probably produced by a
Error:compiler that did not target the modern .class file format. The recommended
Error:solution is to recompile the class from source, using an up-to-date compiler
Error:and without specifying any "-target" type options. The consequence of ignoring
Error:this warning is that reflective operations on this class will incorrectly
Error:indicate that it is *not* an inner class.
Error⚠ Ignoring InnerClasses attribute for an anonymous inner class
Error:(com.umeng.socialize.bean.j) that doesn't come with an
Error:associated EnclosingMethod attribute. This class was probably produced by a
Error:compiler that did not target the modern .class file format. The recommended
Error:solution is to recompile the class from source, using an up-to-date compiler
Error:and without specifying any "-target" type options. The consequence of ignoring
Error:this warning is that reflective operations on this class will incorrectly
Error:indicate that it is *not* an inner class.
Error⚠ Ignoring InnerClasses attribute for an anonymous inner class
Error:(com.umeng.socialize.bean.k) that doesn't come with an
Error:associated EnclosingMethod attribute. This class was probably produced by a
Error:compiler that did not target the modern .class file format. The recommended
Error:solution is to recompile the class from source, using an up-to-date compiler
Error:and without specifying any "-target" type options. The consequence of ignoring
Error:this warning is that reflective operations on this class will incorrectly
Error:indicate that it is *not* an inner class.
Error⚠ Ignoring InnerClasses attribute for an anonymous inner class
Error:(com.umeng.socialize.bean.l) that doesn't come with an
Error:associated EnclosingMethod attribute. This class was probably produced by a
Error:compiler that did not target the modern .class file format. The recommended
Error:solution is to recompile the class from source, using an up-to-date compiler
Error:and without specifying any "-target" type options. The consequence of ignoring
Error:this warning is that reflective operations on this class will incorrectly
Error:indicate that it is *not* an inner class.
Error⚠ Ignoring InnerClasses attribute for an anonymous inner class
Error:(com.umeng.socialize.bean.m) that doesn't come with an
Error:associated EnclosingMethod attribute. This class was probably produced by a
Error:compiler that did not target the modern .class file format. The recommended
Error:solution is to recompile the class from source, using an up-to-date compiler
Error:and without specifying any "-target" type options. The consequence of ignoring
Error:this warning is that reflective operations on this class will incorrectly
Error:indicate that it is *not* an inner class.
Error⚠ Ignoring InnerClasses attribute for an anonymous inner class
Error:(com.umeng.socialize.bean.n) that doesn't come with an
Error:associated EnclosingMethod attribute. This class was probably produced by a
Error:compiler that did not target the modern .class file format. The recommended
Error:solution is to recompile the class from source, using an up-to-date compiler
Error:and without specifying any "-target" type options. The consequence of ignoring
Error:this warning is that reflective operations on this class will incorrectly
Error:indicate that it is *not* an inner class.
Error⚠ Ignoring InnerClasses attribute for an anonymous inner class
Error:(com.umeng.socialize.bean.o) that doesn't come with an
Error:associated EnclosingMethod attribute. This class was probably produced by a
Error:compiler that did not target the modern .class file format. The recommended
Error:solution is to recompile the class from source, using an up-to-date compiler
Error:and without specifying any "-target" type options. The consequence of ignoring
Error:this warning is that reflective operations on this class will incorrectly
Error:indicate that it is *not* an inner class.
Error⚠ Ignoring InnerClasses attribute for an anonymous inner class
Error:(com.umeng.socialize.bean.p) that doesn't come with an
Error:associated EnclosingMethod attribute. This class was probably produced by a
Error:compiler that did not target the modern .class file format. The recommended
Error:solution is to recompile the class from source, using an up-to-date compiler
Error:and without specifying any "-target" type options. The consequence of ignoring
Error:this warning is that reflective operations on this class will incorrectly
Error:indicate that it is *not* an inner class.
Error⚠ Ignoring InnerClasses attribute for an anonymous inner class
Error:(com.umeng.socialize.bean.q) that doesn't come with an
Error:associated EnclosingMethod attribute. This class was probably produced by a
Error:compiler that did not target the modern .class file format. The recommended
Error:solution is to recompile the class from source, using an up-to-date compiler
Error:and without specifying any "-target" type options. The consequence of ignoring
Error:this warning is that reflective operations on this class will incorrectly
Error:indicate that it is *not* an inner class.
Error⚠ Ignoring InnerClasses attribute for an anonymous inner class
Error:(com.umeng.socialize.bean.r) that doesn't come with an
Error:associated EnclosingMethod attribute. This class was probably produced by a
Error:compiler that did not target the modern .class file format. The recommended
Error:solution is to recompile the class from source, using an up-to-date compiler
Error:and without specifying any "-target" type options. The consequence of ignoring
Error:this warning is that reflective operations on this class will incorrectly
Error:indicate that it is *not* an inner class.
Error⚠ Ignoring InnerClasses attribute for an anonymous inner class
Error:(com.umeng.socialize.bean.s) that doesn't come with an
Error:associated EnclosingMethod attribute. This class was probably produced by a
Error:compiler that did not target the modern .class file format. The recommended
Error:solution is to recompile the class from source, using an up-to-date compiler
Error:and without specifying any "-target" type options. The consequence of ignoring
Error:this warning is that reflective operations on this class will incorrectly
Error:indicate that it is *not* an inner class.
Error⚠ Ignoring InnerClasses attribute for an anonymous inner class
Error:(com.umeng.socialize.bean.t) that doesn't come with an
Error:associated EnclosingMethod attribute. This class was probably produced by a
Error:compiler that did not target the modern .class file format. The recommended
Error:solution is to recompile the class from source, using an up-to-date compiler
Error:and without specifying any "-target" type options. The consequence of ignoring
Error:this warning is that reflective operations on this class will incorrectly
Error:indicate that it is *not* an inner class.
Error⚠ Ignoring InnerClasses attribute for an anonymous inner class
Error:(com.umeng.socialize.bean.u) that doesn't come with an
Error:associated EnclosingMethod attribute. This class was probably produced by a
Error:compiler that did not target the modern .class file format. The recommended
Error:solution is to recompile the class from source, using an up-to-date compiler
Error:and without specifying any "-target" type options. The consequence of ignoring
Error:this warning is that reflective operations on this class will incorrectly
Error:indicate that it is *not* an inner class.
Error⚠ Ignoring InnerClasses attribute for an anonymous inner class
Error:(com.umeng.socialize.bean.v) that doesn't come with an
Error:associated EnclosingMethod attribute. This class was probably produced by a
Error:compiler that did not target the modern .class file format. The recommended
Error:solution is to recompile the class from source, using an up-to-date compiler
Error:and without specifying any "-target" type options. The consequence of ignoring
Error:this warning is that reflective operations on this class will incorrectly
Error:indicate that it is *not* an inner class.
Error⚠ Ignoring InnerClasses attribute for an anonymous inner class
Error:(com.umeng.socialize.bean.w) that doesn't come with an
Error:associated EnclosingMethod attribute. This class was probably produced by a
Error:compiler that did not target the modern .class file format. The recommended
Error:solution is to recompile the class from source, using an up-to-date compiler
Error:and without specifying any "-target" type options. The consequence of ignoring
Error:this warning is that reflective operations on this class will incorrectly
Error:indicate that it is *not* an inner class.
Error⚠ Ignoring InnerClasses attribute for an anonymous inner class
Error:(com.umeng.socialize.bean.x) that doesn't come with an
Error:associated EnclosingMethod attribute. This class was probably produced by a
Error:compiler that did not target the modern .class file format. The recommended
Error:solution is to recompile the class from source, using an up-to-date compiler
Error:and without specifying any "-target" type options. The consequence of ignoring
Error:this warning is that reflective operations on this class will incorrectly
Error:indicate that it is *not* an inner class.
Error⚠ Ignoring InnerClasses attribute for an anonymous inner class
Error:(com.umeng.socialize.bean.y) that doesn't come with an
Error:associated EnclosingMethod attribute. This class was probably produced by a
Error:compiler that did not target the modern .class file format. The recommended
Error:solution is to recompile the class from source, using an up-to-date compiler
Error:and without specifying any "-target" type options. The consequence of ignoring
Error:this warning is that reflective operations on this class will incorrectly
Error:indicate that it is *not* an inner class.
Error⚠ Ignoring InnerClasses attribute for an anonymous inner class
Error:(com.umeng.socialize.bean.z) that doesn't come with an
Error:associated EnclosingMethod attribute. This class was probably produced by a
Error:compiler that did not target the modern .class file format. The recommended
Error:solution is to recompile the class from source, using an up-to-date compiler
Error:and without specifying any "-target" type options. The consequence of ignoring
Error:this warning is that reflective operations on this class will incorrectly
Error:indicate that it is *not* an inner class.
Error⚠ Ignoring InnerClasses attribute for an anonymous inner class
Error:(com.umeng.socialize.common.ResContainer$ResType$7) that doesn't come with an
Error:associated EnclosingMethod attribute. This class was probably produced by a
Error:compiler that did not target the modern .class file format. The recommended
Error:solution is to recompile the class from source, using an up-to-date compiler
Error:and without specifying any "-target" type options. The consequence of ignoring
Error:this warning is that reflective operations on this class will incorrectly
Error:indicate that it is *not* an inner class.
Error⚠ Ignoring InnerClasses attribute for an anonymous inner class
Error:(com.umeng.socialize.common.ResContainer$ResType$9) that doesn't come with an
Error:associated EnclosingMethod attribute. This class was probably produced by a
Error:compiler that did not target the modern .class file format. The recommended
Error:solution is to recompile the class from source, using an up-to-date compiler
Error:and without specifying any "-target" type options. The consequence of ignoring
Error:this warning is that reflective operations on this class will incorrectly
Error:indicate that it is *not* an inner class.
Error⚠ Ignoring InnerClasses attribute for an anonymous inner class
Error:(com.umeng.socialize.common.ResContainer$ResType$1) that doesn't come with an
Error:associated EnclosingMethod attribute. This class was probably produced by a
Error:compiler that did not target the modern .class file format. The recommended
Error:solution is to recompile the class from source, using an up-to-date compiler
Error:and without specifying any "-target" type options. The consequence of ignoring
Error:this warning is that reflective operations on this class will incorrectly
Error:indicate that it is *not* an inner class.
Error⚠ Ignoring InnerClasses attribute for an anonymous inner class
Error:(com.umeng.socialize.common.ResContainer$ResType$10) that doesn't come with an
Error:associated EnclosingMethod attribute. This class was probably produced by a
Error:compiler that did not target the modern .class file format. The recommended
Error:solution is to recompile the class from source, using an up-to-date compiler
Error:and without specifying any "-target" type options. The consequence of ignoring
Error:this warning is that reflective operations on this class will incorrectly
Error:indicate that it is *not* an inner class.
Error⚠ Ignoring InnerClasses attribute for an anonymous inner class
Error:(com.umeng.socialize.common.ResContainer$ResType$2) that doesn't come with an
Error:associated EnclosingMethod attribute. This class was probably produced by a
Error:compiler that did not target the modern .class file format. The recommended
Error:solution is to recompile the class from source, using an up-to-date compiler
Error:and without specifying any "-target" type options. The consequence of ignoring
Error:this warning is that reflective operations on this class will incorrectly
Error:indicate that it is *not* an inner class.
Error⚠ Ignoring InnerClasses attribute for an anonymous inner class
Error:(com.umeng.socialize.common.ResContainer$ResType$3) that doesn't come with an
Error:associated EnclosingMethod attribute. This class was probably produced by a
Error:compiler that did not target the modern .class file format. The recommended
Error:solution is to recompile the class from source, using an up-to-date compiler
Error:and without specifying any "-target" type options. The consequence of ignoring
Error:this warning is that reflective operations on this class will incorrectly
Error:indicate that it is *not* an inner class.
Error⚠ Ignoring InnerClasses attribute for an anonymous inner class
Error:(com.umeng.socialize.common.ResContainer$ResType$4) that doesn't come with an
Error:associated EnclosingMethod attribute. This class was probably produced by a
Error:compiler that did not target the modern .class file format. The recommended
Error:solution is to recompile the class from source, using an up-to-date compiler
Error:and without specifying any "-target" type options. The consequence of ignoring
Error:this warning is that reflective operations on this class will incorrectly
Error:indicate that it is *not* an inner class.
Error⚠ Ignoring InnerClasses attribute for an anonymous inner class
Error:(com.umeng.socialize.common.ResContainer$ResType$5) that doesn't come with an
Error:associated EnclosingMethod attribute. This class was probably produced by a
Error:compiler that did not target the modern .class file format. The recommended
Error:solution is to recompile the class from source, using an up-to-date compiler
Error:and without specifying any "-target" type options. The consequence of ignoring
Error:this warning is that reflective operations on this class will incorrectly
Error:indicate that it is *not* an inner class.
Error⚠ Ignoring InnerClasses attribute for an anonymous inner class
Error:(com.umeng.socialize.common.ResContainer$ResType$6) that doesn't come with an
Error:associated EnclosingMethod attribute. This class was probably produced by a
Error:compiler that did not target the modern .class file format. The recommended
Error:solution is to recompile the class from source, using an up-to-date compiler
Error:and without specifying any "-target" type options. The consequence of ignoring
Error:this warning is that reflective operations on this class will incorrectly
Error:indicate that it is *not* an inner class.
Error⚠ Ignoring InnerClasses attribute for an anonymous inner class
Error:(com.umeng.socialize.common.ResContainer$ResType$8) that doesn't come with an
Error:associated EnclosingMethod attribute. This class was probably produced by a
Error:compiler that did not target the modern .class file format. The recommended
Error:solution is to recompile the class from source, using an up-to-date compiler
Error:and without specifying any "-target" type options. The consequence of ignoring
Error:this warning is that reflective operations on this class will incorrectly
Error:indicate that it is *not* an inner class.
Error⚠ Ignoring InnerClasses attribute for an anonymous inner class
Error:(com.umeng.socialize.common.SocialResHelper$Builder$1) that doesn't come with an
Error:associated EnclosingMethod attribute. This class was probably produced by a
Error:compiler that did not target the modern .class file format. The recommended
Error:solution is to recompile the class from source, using an up-to-date compiler
Error:and without specifying any "-target" type options. The consequence of ignoring
Error:this warning is that reflective operations on this class will incorrectly
Error:indicate that it is *not* an inner class.
Error⚠ Ignoring InnerClasses attribute for an anonymous inner class
Error:(com.umeng.socialize.common.UMAsyncTask$1) that doesn't come with an
Error:associated EnclosingMethod attribute. This class was probably produced by a
Error:compiler that did not target the modern .class file format. The recommended
Error:solution is to recompile the class from source, using an up-to-date compiler
Error:and without specifying any "-target" type options. The consequence of ignoring
Error:this warning is that reflective operations on this class will incorrectly
Error:indicate that it is *not* an inner class.
Error⚠ Ignoring InnerClasses attribute for an anonymous inner class
Error:(com.umeng.socialize.common.UMAsyncTask$1$1) that doesn't come with an
Error:associated EnclosingMethod attribute. This class was probably produced by a
Error:compiler that did not target the modern .class file format. The recommended
Error:solution is to recompile the class from source, using an up-to-date compiler
Error:and without specifying any "-target" type options. The consequence of ignoring
Error:this warning is that reflective operations on this class will incorrectly
Error:indicate that it is *not* an inner class.
Error⚠ Ignoring InnerClasses attribute for an anonymous inner class
Error:(com.umeng.socialize.controller.b) that doesn't come with an
Error:associated EnclosingMethod attribute. This class was probably produced by a
Error:compiler that did not target the modern .class file format. The recommended
Error:solution is to recompile the class from source, using an up-to-date compiler
Error:and without specifying any "-target" type options. The consequence of ignoring
Error:this warning is that reflective operations on this class will incorrectly
Error:indicate that it is *not* an inner class.
Error⚠ Ignoring InnerClasses attribute for an anonymous inner class
Error:(com.umeng.socialize.controller.d) that doesn't come with an
Error:associated EnclosingMethod attribute. This class was probably produced by a
Error:compiler that did not target the modern .class file format. The recommended
Error:solution is to recompile the class from source, using an up-to-date compiler
Error:and without specifying any "-target" type options. The consequence of ignoring
Error:this warning is that reflective operations on this class will incorrectly
Error:indicate that it is *not* an inner class.
Error⚠ Ignoring InnerClasses attribute for an anonymous inner class
Error:(com.umeng.socialize.controller.e) that doesn't come with an
Error:associated EnclosingMethod attribute. This class was probably produced by a
Error:compiler that did not target the modern .class file format. The recommended
Error:solution is to recompile the class from source, using an up-to-date compiler
Error:and without specifying any "-target" type options. The consequence of ignoring
Error:this warning is that reflective operations on this class will incorrectly
Error:indicate that it is *not* an inner class.
Error⚠ Ignoring InnerClasses attribute for an anonymous inner class
Error:(com.umeng.socialize.controller.f) that doesn't come with an
Error:associated EnclosingMethod attribute. This class was probably produced by a
Error:compiler that did not target the modern .class file format. The recommended
Error:solution is to recompile the class from source, using an up-to-date compiler
Error:and without specifying any "-target" type options. The consequence of ignoring
Error:this warning is that reflective operations on this class will incorrectly
Error:indicate that it is *not* an inner class.
Error⚠ Ignoring InnerClasses attribute for an anonymous inner class
Error:(com.umeng.socialize.controller.g) that doesn't come with an
Error:associated EnclosingMethod attribute. This class was probably produced by a
Error:compiler that did not target the modern .class file format. The recommended
Error:solution is to recompile the class from source, using an up-to-date compiler
Error:and without specifying any "-target" type options. The consequence of ignoring
Error:this warning is that reflective operations on this class will incorrectly
Error:indicate that it is *not* an inner class.
Error⚠ Ignoring InnerClasses attribute for an anonymous inner class
Error:(com.umeng.socialize.controller.h) that doesn't come with an
Error:associated EnclosingMethod attribute. This class was probably produced by a
Error:compiler that did not target the modern .class file format. The recommended
Error:solution is to recompile the class from source, using an up-to-date compiler
Error:and without specifying any "-target" type options. The consequence of ignoring
Error:this warning is that reflective operations on this class will incorrectly
Error:indicate that it is *not* an inner class.
Error⚠ Ignoring InnerClasses attribute for an anonymous inner class
Error:(com.umeng.socialize.controller.i) that doesn't come with an
Error:associated EnclosingMethod attribute. This class was probably produced by a
Error:compiler that did not target the modern .class file format. The recommended
Error:solution is to recompile the class from source, using an up-to-date compiler
Error:and without specifying any "-target" type options. The consequence of ignoring
Error:this warning is that reflective operations on this class will incorrectly
Error:indicate that it is *not* an inner class.
Error⚠ Ignoring InnerClasses attribute for an anonymous inner class
Error:(com.umeng.socialize.controller.impl.h) that doesn't come with an
Error:associated EnclosingMethod attribute. This class was probably produced by a
Error:compiler that did not target the modern .class file format. The recommended
Error:solution is to recompile the class from source, using an up-to-date compiler
Error:and without specifying any "-target" type options. The consequence of ignoring
Error:this warning is that reflective operations on this class will incorrectly
Error:indicate that it is *not* an inner class.
Error⚠ Ignoring InnerClasses attribute for an anonymous inner class
Error:(com.umeng.socialize.controller.impl.aa) that doesn't come with an
Error:associated EnclosingMethod attribute. This class was probably produced by a
Error:compiler that did not target the modern .class file format. The recommended
Error:solution is to recompile the class from source, using an up-to-date compiler
Error:and without specifying any "-target" type options. The consequence of ignoring
Error:this warning is that reflective operations on this class will incorrectly
Error:indicate that it is *not* an inner class.
Error⚠ Ignoring InnerClasses attribute for an anonymous inner class
Error:(com.umeng.socialize.controller.impl.ab) that doesn't come with an
Error:associated EnclosingMethod attribute. This class was probably produced by a
Error:compiler that did not target the modern .class file format. The recommended
Error:solution is to recompile the class from source, using an up-to-date compiler
Error:and without specifying any "-target" type options. The consequence of ignoring
Error:this warning is that reflective operations on this class will incorrectly
Error:indicate that it is *not* an inner class.
Error⚠ Ignoring InnerClasses attribute for an anonymous inner class
Error:(com.umeng.socialize.controller.impl.b) that doesn't come with an
Error:associated EnclosingMethod attribute. This class was probably produced by a
Error:compiler that did not target the modern .class file format. The recommended
Error:solution is to recompile the class from source, using an up-to-date compiler
Error:and without specifying any "-target" type options. The consequence of ignoring
Error:this warning is that reflective operations on this class will incorrectly
Error:indicate that it is *not* an inner class.
Error⚠ Ignoring InnerClasses attribute for an anonymous inner class
Error:(com.umeng.socialize.controller.impl.c) that doesn't come with an
Error:associated EnclosingMethod attribute. This class was probably produced by a
Error:compiler that did not target the modern .class file format. The recommended
Error:solution is to recompile the class from source, using an up-to-date compiler
Error:and without specifying any "-target" type options. The consequence of ignoring
Error:this warning is that reflective operations on this class will incorrectly
Error:indicate that it is *not* an inner class.
Error⚠ Ignoring InnerClasses attribute for an anonymous inner class
Error:(com.umeng.socialize.controller.impl.d) that doesn't come with an
Error:associated EnclosingMethod attribute. This class was probably produced by a
Error:compiler that did not target the modern .class file format. The recommended
Error:solution is to recompile the class from source, using an up-to-date compiler
Error:and without specifying any "-target" type options. The consequence of ignoring
Error:this warning is that reflective operations on this class will incorrectly
Error:indicate that it is *not* an inner class.
Error⚠ Ignoring InnerClasses attribute for an anonymous inner class
Error:(com.umeng.socialize.controller.impl.e) that doesn't come with an
Error:associated EnclosingMethod attribute. This class was probably produced by a
Error:compiler that did not target the modern .class file format. The recommended
Error:solution is to recompile the class from source, using an up-to-date compiler
Error:and without specifying any "-target" type options. The consequence of ignoring
Error:this warning is that reflective operations on this class will incorrectly
Error:indicate that it is *not* an inner class.
Error⚠ Ignoring InnerClasses attribute for an anonymous inner class
Error:(com.umeng.socialize.controller.impl.p) that doesn't come with an
Error:associated EnclosingMethod attribute. This class was probably produced by a
Error:compiler that did not target the modern .class file format. The recommended
Error:solution is to recompile the class from source, using an up-to-date compiler
Error:and without specifying any "-target" type options. The consequence of ignoring
Error:this warning is that reflective operations on this class will incorrectly
Error:indicate that it is *not* an inner class.
Error⚠ Ignoring InnerClasses attribute for an anonymous inner class
Error:(com.umeng.socialize.controller.impl.g) that doesn't come with an
Error:associated EnclosingMethod attribute. This class was probably produced by a
Error:compiler that did not target the modern .class file format. The recommended
Error:solution is to recompile the class from source, using an up-to-date compiler
Error:and without specifying any "-target" type options. The consequence of ignoring
Error:this warning is that reflective operations on this class will incorrectly
Error:indicate that it is *not* an inner class.
Error⚠ Ignoring InnerClasses attribute for an anonymous inner class
Error:(com.umeng.socialize.controller.impl.i) that doesn't come with an
Error:associated EnclosingMethod attribute. This class was probably produced by a
Error:compiler that did not target the modern .class file format. The recommended
Error:solution is to recompile the class from source, using an up-to-date compiler
Error:and without specifying any "-target" type options. The consequence of ignoring
Error:this warning is that reflective operations on this class will incorrectly
Error:indicate that it is *not* an inner class.
Error⚠ Ignoring InnerClasses attribute for an anonymous inner class
Error:(com.umeng.socialize.controller.impl.s) that doesn't come with an
Error:associated EnclosingMethod attribute. This class was probably produced by a
Error:compiler that did not target the modern .class file format. The recommended
Error:solution is to recompile the class from source, using an up-to-date compiler
Error:and without specifying any "-target" type options. The consequence of ignoring
Error:this warning is that reflective operations on this class will incorrectly
Error:indicate that it is *not* an inner class.
Error⚠ Ignoring InnerClasses attribute for an anonymous inner class
Error:(com.umeng.socialize.controller.impl.t) that doesn't come with an
Error:associated EnclosingMethod attribute. This class was probably produced by a
Error:compiler that did not target the modern .class file format. The recommended
Error:solution is to recompile the class from source, using an up-to-date compiler
Error:and without specifying any "-target" type options. The consequence of ignoring
Error:this warning is that reflective operations on this class will incorrectly
Error:indicate that it is *not* an inner class.
Error⚠ Ignoring InnerClasses attribute for an anonymous inner class
Error:(com.umeng.socialize.controller.impl.f) that doesn't come with an
Error:associated EnclosingMethod attribute. This class was probably produced by a
Error:compiler that did not target the modern .class file format. The recommended
Error:solution is to recompile the class from source, using an up-to-date compiler
Error:and without specifying any "-target" type options. The consequence of ignoring
Error:this warning is that reflective operations on this class will incorrectly
Error:indicate that it is *not* an inner class.
Error⚠ Ignoring InnerClasses attribute for an anonymous inner class
Error:(com.umeng.socialize.controller.impl.j) that doesn't come with an
Error:associated EnclosingMethod attribute. This class was probably produced by a
Error:compiler that did not target the modern .class file format. The recommended
Error:solution is to recompile the class from source, using an up-to-date compiler
Error:and without specifying any "-target" type options. The consequence of ignoring
Error:this warning is that reflective operations on this class will incorrectly
Error:indicate that it is *not* an inner class.
Error⚠ Ignoring InnerClasses attribute for an anonymous inner class
Error:(com.umeng.socialize.controller.impl.k) that doesn't come with an
Error:associated EnclosingMethod attribute. This class was probably produced by a
Error:compiler that did not target the modern .class file format. The recommended
Error:solution is to recompile the class from source, using an up-to-date compiler
Error:and without specifying any "-target" type options. The consequence of ignoring
Error:this warning is that reflective operations on this class will incorrectly
Error:indicate that it is *not* an inner class.
Error⚠ Ignoring InnerClasses attribute for an anonymous inner class
Error:(com.umeng.socialize.controller.impl.l) that doesn't come with an
Error:associated EnclosingMethod attribute. This class was probably produced by a
Error:compiler that did not target the modern .class file format. The recommended
Error:solution is to recompile the class from source, using an up-to-date compiler
Error:and without specifying any "-target" type options. The consequence of ignoring
Error:this warning is that reflective operations on this class will incorrectly
Error:indicate that it is *not* an inner class.
Error⚠ Ignoring InnerClasses attribute for an anonymous inner class
Error:(com.umeng.socialize.controller.impl.x) that doesn't come with an
Error:associated EnclosingMethod attribute. This class was probably produced by a
Error:compiler that did not target the modern .class file format. The recommended
Error:solution is to recompile the class from source, using an up-to-date compiler
Error:and without specifying any "-target" type options. The consequence of ignoring
Error:this warning is that reflective operations on this class will incorrectly
Error:indicate that it is *not* an inner class.
Error⚠ Ignoring InnerClasses attribute for an anonymous inner class
Error:(com.umeng.socialize.controller.impl.o) that doesn't come with an
Error:associated EnclosingMethod attribute. This class was probably produced by a
Error:compiler that did not target the modern .class file format. The recommended
Error:solution is to recompile the class from source, using an up-to-date compiler
Error:and without specifying any "-target" type options. The consequence of ignoring
Error:this warning is that reflective operations on this class will incorrectly
Error:indicate that it is *not* an inner class.
Error⚠ Ignoring InnerClasses attribute for an anonymous inner class
Error:(com.umeng.socialize.controller.impl.q) that doesn't come with an
Error:associated EnclosingMethod attribute. This class was probably produced by a
Error:compiler that did not target the modern .class file format. The recommended
Error:solution is to recompile the class from source, using an up-to-date compiler
Error:and without specifying any "-target" type options. The consequence of ignoring
Error:this warning is that reflective operations on this class will incorrectly
Error:indicate that it is *not* an inner class.
Error⚠ Ignoring InnerClasses attribute for an anonymous inner class
Error:(com.umeng.socialize.controller.impl.r) that doesn't come with an
Error:associated EnclosingMethod attribute. This class was probably produced by a
Error:compiler that did not target the modern .class file format. The recommended
Error:solution is to recompile the class from source, using an up-to-date compiler
Error:and without specifying any "-target" type options. The consequence of ignoring
Error:this warning is that reflective operations on this class will incorrectly
Error:indicate that it is *not* an inner class.
Error⚠ Ignoring InnerClasses attribute for an anonymous inner class
Error:(com.umeng.socialize.controller.impl.u) that doesn't come with an
Error:associated EnclosingMethod attribute. This class was probably produced by a
Error:compiler that did not target the modern .class file format. The recommended
Error:solution is to recompile the class from source, using an up-to-date compiler
Error:and without specifying any "-target" type options. The consequence of ignoring
Error:this warning is that reflective operations on this class will incorrectly
Error:indicate that it is *not* an inner class.
Error⚠ Ignoring InnerClasses attribute for an anonymous inner class
Error:(com.umeng.socialize.controller.impl.v) that doesn't come with an
Error:associated EnclosingMethod attribute. This class was probably produced by a
Error:compiler that did not target the modern .class file format. The recommended
Error:solution is to recompile the class from source, using an up-to-date compiler
Error:and without specifying any "-target" type options. The consequence of ignoring
Error:this warning is that reflective operations on this class will incorrectly
Error:indicate that it is *not* an inner class.
Error⚠ Ignoring InnerClasses attribute for an anonymous inner class
Error:(com.umeng.socialize.controller.impl.y) that doesn't come with an
Error:associated EnclosingMethod attribute. This class was probably produced by a
Error:compiler that did not target the modern .class file format. The recommended
Error:solution is to recompile the class from source, using an up-to-date compiler
Error:and without specifying any "-target" type options. The consequence of ignoring
Error:this warning is that reflective operations on this class will incorrectly
Error:indicate that it is *not* an inner class.
Error⚠ Ignoring InnerClasses attribute for an anonymous inner class
Error:(com.umeng.socialize.controller.impl.z) that doesn't come with an
Error:associated EnclosingMethod attribute. This class was probably produced by a
Error:compiler that did not target the modern .class file format. The recommended
Error:solution is to recompile the class from source, using an up-to-date compiler
Error:and without specifying any "-target" type options. The consequence of ignoring
Error:this warning is that reflective operations on this class will incorrectly
Error:indicate that it is *not* an inner class.
Error⚠ Ignoring InnerClasses attribute for an anonymous inner class
Error:(com.umeng.socialize.controller.j) that doesn't come with an
Error:associated EnclosingMethod attribute. This class was probably produced by a
Error:compiler that did not target the modern .class file format. The recommended
Error:solution is to recompile the class from source, using an up-to-date compiler
Error:and without specifying any "-target" type options. The consequence of ignoring
Error:this warning is that reflective operations on this class will incorrectly
Error:indicate that it is *not* an inner class.
Error⚠ Ignoring InnerClasses attribute for an anonymous inner class
Error:(com.umeng.socialize.controller.k) that doesn't come with an
Error:associated EnclosingMethod attribute. This class was probably produced by a
Error:compiler that did not target the modern .class file format. The recommended
Error:solution is to recompile the class from source, using an up-to-date compiler
Error:and without specifying any "-target" type options. The consequence of ignoring
Error:this warning is that reflective operations on this class will incorrectly
Error:indicate that it is *not* an inner class.
Error⚠ Ignoring InnerClasses attribute for an anonymous inner class
Error:(com.umeng.socialize.location.SocializeLocationManager$1) that doesn't come with an
Error:associated EnclosingMethod attribute. This class was probably produced by a
Error:compiler that did not target the modern .class file format. The recommended
Error:solution is to recompile the class from source, using an up-to-date compiler
Error:and without specifying any "-target" type options. The consequence of ignoring
Error:this warning is that reflective operations on this class will incorrectly
Error:indicate that it is *not* an inner class.
Error⚠ Ignoring InnerClasses attribute for an anonymous inner class
Error:(com.umeng.socialize.media.DoubanShareContent$1) that doesn't come with an
Error:associated EnclosingMethod attribute. This class was probably produced by a
Error:compiler that did not target the modern .class file format. The recommended
Error:solution is to recompile the class from source, using an up-to-date compiler
Error:and without specifying any "-target" type options. The consequence of ignoring
Error:this warning is that reflective operations on this class will incorrectly
Error:indicate that it is *not* an inner class.
Error⚠ Ignoring InnerClasses attribute for an anonymous inner class
Error:(com.umeng.socialize.media.GooglePlusShareContent$1) that doesn't come with an
Error:associated EnclosingMethod attribute. This class was probably produced by a
Error:compiler that did not target the modern .class file format. The recommended
Error:solution is to recompile the class from source, using an up-to-date compiler
Error:and without specifying any "-target" type options. The consequence of ignoring
Error:this warning is that reflective operations on this class will incorrectly
Error:indicate that it is *not* an inner class.
Error⚠ Ignoring InnerClasses attribute for an anonymous inner class
Error:(com.umeng.socialize.media.RenrenShareContent$1) that doesn't come with an
Error:associated EnclosingMethod attribute. This class was probably produced by a
Error:compiler that did not target the modern .class file format. The recommended
Error:solution is to recompile the class from source, using an up-to-date compiler
Error:and without specifying any "-target" type options. The consequence of ignoring
Error:this warning is that reflective operations on this class will incorrectly
Error:indicate that it is *not* an inner class.
Error⚠ Ignoring InnerClasses attribute for an anonymous inner class
Error:(com.umeng.socialize.media.UMEmoji$1) that doesn't come with an
Error:associated EnclosingMethod attribute. This class was probably produced by a
Error:compiler that did not target the modern .class file format. The recommended
Error:solution is to recompile the class from source, using an up-to-date compiler
Error:and without specifying any "-target" type options. The consequence of ignoring
Error:this warning is that reflective operations on this class will incorrectly
Error:indicate that it is *not* an inner class.
Error⚠ Ignoring InnerClasses attribute for an anonymous inner class
Error:(com.umeng.socialize.media.SinaShareContent$1) that doesn't come with an
Error:associated EnclosingMethod attribute. This class was probably produced by a
Error:compiler that did not target the modern .class file format. The recommended
Error:solution is to recompile the class from source, using an up-to-date compiler
Error:and without specifying any "-target" type options. The consequence of ignoring
Error:this warning is that reflective operations on this class will incorrectly
Error:indicate that it is *not* an inner class.
Error⚠ Ignoring InnerClasses attribute for an anonymous inner class
Error:(com.umeng.socialize.media.TencentWbShareContent$1) that doesn't come with an
Error:associated EnclosingMethod attribute. This class was probably produced by a
Error:compiler that did not target the modern .class file format. The recommended
Error:solution is to recompile the class from source, using an up-to-date compiler
Error:and without specifying any "-target" type options. The consequence of ignoring
Error:this warning is that reflective operations on this class will incorrectly
Error:indicate that it is *not* an inner class.
Error⚠ Ignoring InnerClasses attribute for an anonymous inner class
Error:(com.umeng.socialize.media.TwitterShareContent$1) that doesn't come with an
Error:associated EnclosingMethod attribute. This class was probably produced by a
Error:compiler that did not target the modern .class file format. The recommended
Error:solution is to recompile the class from source, using an up-to-date compiler
Error:and without specifying any "-target" type options. The consequence of ignoring
Error:this warning is that reflective operations on this class will incorrectly
Error:indicate that it is *not* an inner class.
Error⚠ Ignoring InnerClasses attribute for an anonymous inner class
Error:(com.umeng.socialize.media.UMImage$1) that doesn't come with an
Error:associated EnclosingMethod attribute. This class was probably produced by a
Error:compiler that did not target the modern .class file format. The recommended
Error:solution is to recompile the class from source, using an up-to-date compiler
Error:and without specifying any "-target" type options. The consequence of ignoring
Error:this warning is that reflective operations on this class will incorrectly
Error:indicate that it is *not* an inner class.
Error⚠ Ignoring InnerClasses attribute for an anonymous inner class
Error:(com.umeng.socialize.media.UMImage$2) that doesn't come with an
Error:associated EnclosingMethod attribute. This class was probably produced by a
Error:compiler that did not target the modern .class file format. The recommended
Error:solution is to recompile the class from source, using an up-to-date compiler
Error:and without specifying any "-target" type options. The consequence of ignoring
Error:this warning is that reflective operations on this class will incorrectly
Error:indicate that it is *not* an inner class.
Error⚠ Ignoring InnerClasses attribute for an anonymous inner class
Error:(com.umeng.socialize.media.UMImage$3) that doesn't come with an
Error:associated EnclosingMethod attribute. This class was probably produced by a
Error:compiler that did not target the modern .class file format. The recommended
Error:solution is to recompile the class from source, using an up-to-date compiler
Error:and without specifying any "-target" type options. The consequence of ignoring
Error:this warning is that reflective operations on this class will incorrectly
Error:indicate that it is *not* an inner class.
Error⚠ Ignoring InnerClasses attribute for an anonymous inner class
Error:(com.umeng.socialize.media.UMImage$4) that doesn't come with an
Error:associated EnclosingMethod attribute. This class was probably produced by a
Error:compiler that did not target the modern .class file format. The recommended
Error:solution is to recompile the class from source, using an up-to-date compiler
Error:and without specifying any "-target" type options. The consequence of ignoring
Error:this warning is that reflective operations on this class will incorrectly
Error:indicate that it is *not* an inner class.
Error⚠ Ignoring InnerClasses attribute for an anonymous inner class
Error:(com.umeng.socialize.media.UMImage$5) that doesn't come with an
Error:associated EnclosingMethod attribute. This class was probably produced by a
Error:compiler that did not target the modern .class file format. The recommended
Error:solution is to recompile the class from source, using an up-to-date compiler
Error:and without specifying any "-target" type options. The consequence of ignoring
Error:this warning is that reflective operations on this class will incorrectly
Error:indicate that it is *not* an inner class.
Error⚠ Ignoring InnerClasses attribute for an anonymous inner class
Error:(com.umeng.socialize.media.UMediaObject$MediaType$6) that doesn't come with an
Error:associated EnclosingMethod attribute. This class was probably produced by a
Error:compiler that did not target the modern .class file format. The recommended
Error:solution is to recompile the class from source, using an up-to-date compiler
Error:and without specifying any "-target" type options. The consequence of ignoring
Error:this warning is that reflective operations on this class will incorrectly
Error:indicate that it is *not* an inner class.
Error⚠ Ignoring InnerClasses attribute for an anonymous inner class
Error:(com.umeng.socialize.media.UMVideo$1) that doesn't come with an
Error:associated EnclosingMethod attribute. This class was probably produced by a
Error:compiler that did not target the modern .class file format. The recommended
Error:solution is to recompile the class from source, using an up-to-date compiler
Error:and without specifying any "-target" type options. The consequence of ignoring
Error:this warning is that reflective operations on this class will incorrectly
Error:indicate that it is *not* an inner class.
Error⚠ Ignoring InnerClasses attribute for an anonymous inner class
Error:(com.umeng.socialize.media.UMediaObject$MediaType$1) that doesn't come with an
Error:associated EnclosingMethod attribute. This class was probably produced by a
Error:compiler that did not target the modern .class file format. The recommended
Error:solution is to recompile the class from source, using an up-to-date compiler
Error:and without specifying any "-target" type options. The consequence of ignoring
Error:this warning is that reflective operations on this class will incorrectly
Error:indicate that it is *not* an inner class.
Error⚠ Ignoring InnerClasses attribute for an anonymous inner class
Error:(com.umeng.socialize.media.UMediaObject$MediaType$2) that doesn't come with an
Error:associated EnclosingMethod attribute. This class was probably produced by a
Error:compiler that did not target the modern .class file format. The recommended
Error:solution is to recompile the class from source, using an up-to-date compiler
Error:and without specifying any "-target" type options. The consequence of ignoring
Error:this warning is that reflective operations on this class will incorrectly
Error:indicate that it is *not* an inner class.
Error⚠ Ignoring InnerClasses attribute for an anonymous inner class
Error:(com.umeng.socialize.media.UMediaObject$MediaType$3) that doesn't come with an
Error:associated EnclosingMethod attribute. This class was probably produced by a
Error:compiler that did not target the modern .class file format. The recommended
Error:solution is to recompile the class from source, using an up-to-date compiler
Error:and without specifying any "-target" type options. The consequence of ignoring
Error:this warning is that reflective operations on this class will incorrectly
Error:indicate that it is *not* an inner class.
Error⚠ Ignoring InnerClasses attribute for an anonymous inner class
Error:(com.umeng.socialize.media.UMediaObject$MediaType$4) that doesn't come with an
Error:associated EnclosingMethod attribute. This class was probably produced by a
Error:compiler that did not target the modern .class file format. The recommended
Error:solution is to recompile the class from source, using an up-to-date compiler
Error:and without specifying any "-target" type options. The consequence of ignoring
Error:this warning is that reflective operations on this class will incorrectly
Error:indicate that it is *not* an inner class.
Error⚠ Ignoring InnerClasses attribute for an anonymous inner class
Error:(com.umeng.socialize.media.UMediaObject$MediaType$5) that doesn't come with an
Error:associated EnclosingMethod attribute. This class was probably produced by a
Error:compiler that did not target the modern .class file format. The recommended
Error:solution is to recompile the class from source, using an up-to-date compiler
Error:and without specifying any "-target" type options. The consequence of ignoring
Error:this warning is that reflective operations on this class will incorrectly
Error:indicate that it is *not* an inner class.
Error⚠ Ignoring InnerClasses attribute for an anonymous inner class
Error:(com.umeng.socialize.media.UMusic$1) that doesn't come with an
Error:associated EnclosingMethod attribute. This class was probably produced by a
Error:compiler that did not target the modern .class file format. The recommended
Error:solution is to recompile the class from source, using an up-to-date compiler
Error:and without specifying any "-target" type options. The consequence of ignoring
Error:this warning is that reflective operations on this class will incorrectly
Error:indicate that it is *not* an inner class.
Error⚠ Ignoring InnerClasses attribute for an anonymous inner class
Error:(com.umeng.socialize.net.base.SocializeRequest$RequestMethod$1) that doesn't come with an
Error:associated EnclosingMethod attribute. This class was probably produced by a
Error:compiler that did not target the modern .class file format. The recommended
Error:solution is to recompile the class from source, using an up-to-date compiler
Error:and without specifying any "-target" type options. The consequence of ignoring
Error:this warning is that reflective operations on this class will incorrectly
Error:indicate that it is *not* an inner class.
Error⚠ Ignoring InnerClasses attribute for an anonymous inner class
Error:(com.umeng.socialize.net.base.SocializeRequest$RequestMethod$2) that doesn't come with an
Error:associated EnclosingMethod attribute. This class was probably produced by a
Error:compiler that did not target the modern .class file format. The recommended
Error:solution is to recompile the class from source, using an up-to-date compiler
Error:and without specifying any "-target" type options. The consequence of ignoring
Error:this warning is that reflective operations on this class will incorrectly
Error:indicate that it is *not* an inner class.
Error⚠ Ignoring InnerClasses attribute for an anonymous inner class
Error:(com.umeng.socialize.sso.a) that doesn't come with an
Error:associated EnclosingMethod attribute. This class was probably produced by a
Error:compiler that did not target the modern .class file format. The recommended
Error:solution is to recompile the class from source, using an up-to-date compiler
Error:and without specifying any "-target" type options. The consequence of ignoring
Error:this warning is that reflective operations on this class will incorrectly
Error:indicate that it is *not* an inner class.
Error⚠ Ignoring InnerClasses attribute for an anonymous inner class
Error:(com.umeng.socialize.utils.ListenerUtils$1) that doesn't come with an
Error:associated EnclosingMethod attribute. This class was probably produced by a
Error:compiler that did not target the modern .class file format. The recommended
Error:solution is to recompile the class from source, using an up-to-date compiler
Error:and without specifying any "-target" type options. The consequence of ignoring
Error:this warning is that reflective operations on this class will incorrectly
Error:indicate that it is *not* an inner class.
Error⚠ Ignoring InnerClasses attribute for an anonymous inner class
Error:(com.umeng.socialize.utils.ListenerUtils$2) that doesn't come with an
Error:associated EnclosingMethod attribute. This class was probably produced by a
Error:compiler that did not target the modern .class file format. The recommended
Error:solution is to recompile the class from source, using an up-to-date compiler
Error:and without specifying any "-target" type options. The consequence of ignoring
Error:this warning is that reflective operations on this class will incorrectly
Error:indicate that it is *not* an inner class.
Error⚠ Ignoring InnerClasses attribute for an anonymous inner class
Error:(com.umeng.socialize.utils.ListenerUtils$3) that doesn't come with an
Error:associated EnclosingMethod attribute. This class was probably produced by a
Error:compiler that did not target the modern .class file format. The recommended
Error:solution is to recompile the class from source, using an up-to-date compiler
Error:and without specifying any "-target" type options. The consequence of ignoring
Error:this warning is that reflective operations on this class will incorrectly
Error:indicate that it is *not* an inner class.
Error⚠ Ignoring InnerClasses attribute for an anonymous inner class
Error:(com.umeng.socialize.utils.ResUtil$1) that doesn't come with an
Error:associated EnclosingMethod attribute. This class was probably produced by a
Error:compiler that did not target the modern .class file format. The recommended
Error:solution is to recompile the class from source, using an up-to-date compiler
Error:and without specifying any "-target" type options. The consequence of ignoring
Error:this warning is that reflective operations on this class will incorrectly
Error:indicate that it is *not* an inner class.
Error⚠ Ignoring InnerClasses attribute for an anonymous inner class
Error:(com.umeng.socialize.view.abs.a) that doesn't come with an
Error:associated EnclosingMethod attribute. This class was probably produced by a
Error:compiler that did not target the modern .class file format. The recommended
Error:solution is to recompile the class from source, using an up-to-date compiler
Error:and without specifying any "-target" type options. The consequence of ignoring
Error:this warning is that reflective operations on this class will incorrectly
Error:indicate that it is *not* an inner class.
Error⚠ Ignoring InnerClasses attribute for an anonymous inner class
Error:(com.umeng.socialize.view.ac) that doesn't come with an
Error:associated EnclosingMethod attribute. This class was probably produced by a
Error:compiler that did not target the modern .class file format. The recommended
Error:solution is to recompile the class from source, using an up-to-date compiler
Error:and without specifying any "-target" type options. The consequence of ignoring
Error:this warning is that reflective operations on this class will incorrectly
Error:indicate that it is *not* an inner class.
Error⚠ Ignoring InnerClasses attribute for an anonymous inner class
Error:(com.umeng.socialize.view.ad) that doesn't come with an
Error:associated EnclosingMethod attribute. This class was probably produced by a
Error:compiler that did not target the modern .class file format. The recommended
Error:solution is to recompile the class from source, using an up-to-date compiler
Error:and without specifying any "-target" type options. The consequence of ignoring
Error:this warning is that reflective operations on this class will incorrectly
Error:indicate that it is *not* an inner class.
Error⚠ Ignoring InnerClasses attribute for an anonymous inner class
Error:(com.umeng.socialize.view.af) that doesn't come with an
Error:associated EnclosingMethod attribute. This class was probably produced by a
Error:compiler that did not target the modern .class file format. The recommended
Error:solution is to recompile the class from source, using an up-to-date compiler
Error:and without specifying any "-target" type options. The consequence of ignoring
Error:this warning is that reflective operations on this class will incorrectly
Error:indicate that it is *not* an inner class.
Error⚠ Ignoring InnerClasses attribute for an anonymous inner class
Error:(com.umeng.socialize.view.ah) that doesn't come with an
Error:associated EnclosingMethod attribute. This class was probably produced by a
Error:compiler that did not target the modern .class file format. The recommended
Error:solution is to recompile the class from source, using an up-to-date compiler
Error:and without specifying any "-target" type options. The consequence of ignoring
Error:this warning is that reflective operations on this class will incorrectly
Error:indicate that it is *not* an inner class.
Error⚠ Ignoring InnerClasses attribute for an anonymous inner class
Error:(com.umeng.socialize.view.a) that doesn't come with an
Error:associated EnclosingMethod attribute. This class was probably produced by a
Error:compiler that did not target the modern .class file format. The recommended
Error:solution is to recompile the class from source, using an up-to-date compiler
Error:and without specifying any "-target" type options. The consequence of ignoring
Error:this warning is that reflective operations on this class will incorrectly
Error:indicate that it is *not* an inner class.
Error⚠ Ignoring InnerClasses attribute for an anonymous inner class
Error:(com.umeng.socialize.view.aa) that doesn't come with an
Error:associated EnclosingMethod attribute. This class was probably produced by a
Error:compiler that did not target the modern .class file format. The recommended
Error:solution is to recompile the class from source, using an up-to-date compiler
Error:and without specifying any "-target" type options. The consequence of ignoring
Error:this warning is that reflective operations on this class will incorrectly
Error:indicate that it is *not* an inner class.
Error⚠ Ignoring InnerClasses attribute for an anonymous inner class
Error:(com.umeng.socialize.view.al) that doesn't come with an
Error:associated EnclosingMethod attribute. This class was probably produced by a
Error:compiler that did not target the modern .class file format. The recommended
Error:solution is to recompile the class from source, using an up-to-date compiler
Error:and without specifying any "-target" type options. The consequence of ignoring
Error:this warning is that reflective operations on this class will incorrectly
Error:indicate that it is *not* an inner class.
Error⚠ Ignoring InnerClasses attribute for an anonymous inner class
Error:(com.umeng.socialize.view.ab) that doesn't come with an
Error:associated EnclosingMethod attribute. This class was probably produced by a
Error:compiler that did not target the modern .class file format. The recommended
Error:solution is to recompile the class from source, using an up-to-date compiler
Error:and without specifying any "-target" type options. The consequence of ignoring
Error:this warning is that reflective operations on this class will incorrectly
Error:indicate that it is *not* an inner class.
Error⚠ Ignoring InnerClasses attribute for an anonymous inner class
Error:(com.umeng.socialize.view.c) that doesn't come with an
Error:associated EnclosingMethod attribute. This class was probably produced by a
Error:compiler that did not target the modern .class file format. The recommended
Error:solution is to recompile the class from source, using an up-to-date compiler
Error:and without specifying any "-target" type options. The consequence of ignoring
Error:this warning is that reflective operations on this class will incorrectly
Error:indicate that it is *not* an inner class.
Error⚠ Ignoring InnerClasses attribute for an anonymous inner class
Error:(com.umeng.socialize.view.d) that doesn't come with an
Error:associated EnclosingMethod attribute. This class was probably produced by a
Error:compiler that did not target the modern .class file format. The recommended
Error:solution is to recompile the class from source, using an up-to-date compiler
Error:and without specifying any "-target" type options. The consequence of ignoring
Error:this warning is that reflective operations on this class will incorrectly
Error:indicate that it is *not* an inner class.
Error⚠ Ignoring InnerClasses attribute for an anonymous inner class
Error:(com.umeng.socialize.view.f) that doesn't come with an
Error:associated EnclosingMethod attribute. This class was probably produced by a
Error:compiler that did not target the modern .class file format. The recommended
Error:solution is to recompile the class from source, using an up-to-date compiler
Error:and without specifying any "-target" type options. The consequence of ignoring
Error:this warning is that reflective operations on this class will incorrectly
Error:indicate that it is *not* an inner class.
Error⚠ Ignoring InnerClasses attribute for an anonymous inner class
Error:(com.umeng.socialize.view.g) that doesn't come with an
Error:associated EnclosingMethod attribute. This class was probably produced by a
Error:compiler that did not target the modern .class file format. The recommended
Error:solution is to recompile the class from source, using an up-to-date compiler
Error:and without specifying any "-target" type options. The consequence of ignoring
Error:this warning is that reflective operations on this class will incorrectly
Error:indicate that it is *not* an inner class.
Error⚠ Ignoring InnerClasses attribute for an anonymous inner class
Error:(com.umeng.socialize.view.h) that doesn't come with an
Error:associated EnclosingMethod attribute. This class was probably produced by a
Error:compiler that did not target the modern .class file format. The recommended
Error:solution is to recompile the class from source, using an up-to-date compiler
Error:and without specifying any "-target" type options. The consequence of ignoring
Error:this warning is that reflective operations on this class will incorrectly
Error:indicate that it is *not* an inner class.
Error⚠ Ignoring InnerClasses attribute for an anonymous inner class
Error:(com.umeng.socialize.view.i) that doesn't come with an
Error:associated EnclosingMethod attribute. This class was probably produced by a
Error:compiler that did not target the modern .class file format. The recommended
Error:solution is to recompile the class from source, using an up-to-date compiler
Error:and without specifying any "-target" type options. The consequence of ignoring
Error:this warning is that reflective operations on this class will incorrectly
Error:indicate that it is *not* an inner class.
Error⚠ Ignoring InnerClasses attribute for an anonymous inner class
Error:(com.umeng.socialize.view.ae) that doesn't come with an
Error:associated EnclosingMethod attribute. This class was probably produced by a
Error:compiler that did not target the modern .class file format. The recommended
Error:solution is to recompile the class from source, using an up-to-date compiler
Error:and without specifying any "-target" type options. The consequence of ignoring
Error:this warning is that reflective operations on this class will incorrectly
Error:indicate that it is *not* an inner class.
Error⚠ Ignoring InnerClasses attribute for an anonymous inner class
Error:(com.umeng.socialize.view.ag) that doesn't come with an
Error:associated EnclosingMethod attribute. This class was probably produced by a
Error:compiler that did not target the modern .class file format. The recommended
Error:solution is to recompile the class from source, using an up-to-date compiler
Error:and without specifying any "-target" type options. The consequence of ignoring
Error:this warning is that reflective operations on this class will incorrectly
Error:indicate that it is *not* an inner class.
Error⚠ Ignoring InnerClasses attribute for an anonymous inner class
Error:(com.umeng.socialize.view.m) that doesn't come with an
Error:associated EnclosingMethod attribute. This class was probably produced by a
Error:compiler that did not target the modern .class file format. The recommended
Error:solution is to recompile the class from source, using an up-to-date compiler
Error:and without specifying any "-target" type options. The consequence of ignoring
Error:this warning is that reflective operations on this class will incorrectly
Error:indicate that it is *not* an inner class.
Error⚠ Ignoring InnerClasses attribute for an anonymous inner class
Error:(com.umeng.socialize.view.aj) that doesn't come with an
Error:associated EnclosingMethod attribute. This class was probably produced by a
Error:compiler that did not target the modern .class file format. The recommended
Error:solution is to recompile the class from source, using an up-to-date compiler
Error:and without specifying any "-target" type options. The consequence of ignoring
Error:this warning is that reflective operations on this class will incorrectly
Error:indicate that it is *not* an inner class.
Error⚠ Ignoring InnerClasses attribute for an anonymous inner class
Error:(com.umeng.socialize.view.o) that doesn't come with an
Error:associated EnclosingMethod attribute. This class was probably produced by a
Error:compiler that did not target the modern .class file format. The recommended
Error:solution is to recompile the class from source, using an up-to-date compiler
Error:and without specifying any "-target" type options. The consequence of ignoring
Error:this warning is that reflective operations on this class will incorrectly
Error:indicate that it is *not* an inner class.
Error⚠ Ignoring InnerClasses attribute for an anonymous inner class
Error:(com.umeng.socialize.view.ak) that doesn't come with an
Error:associated EnclosingMethod attribute. This class was probably produced by a
Error:compiler that did not target the modern .class file format. The recommended
Error:solution is to recompile the class from source, using an up-to-date compiler
Error:and without specifying any "-target" type options. The consequence of ignoring
Error:this warning is that reflective operations on this class will incorrectly
Error:indicate that it is *not* an inner class.
Error⚠ Ignoring InnerClasses attribute for an anonymous inner class
Error:(com.umeng.socialize.view.q) that doesn't come with an
Error:associated EnclosingMethod attribute. This class was probably produced by a
Error:compiler that did not target the modern .class file format. The recommended
Error:solution is to recompile the class from source, using an up-to-date compiler
Error:and without specifying any "-target" type options. The consequence of ignoring
Error:this warning is that reflective operations on this class will incorrectly
Error:indicate that it is *not* an inner class.
Error⚠ Ignoring InnerClasses attribute for an anonymous inner class
Error:(com.umeng.socialize.view.b) that doesn't come with an
Error:associated EnclosingMethod attribute. This class was probably produced by a
Error:compiler that did not target the modern .class file format. The recommended
Error:solution is to recompile the class from source, using an up-to-date compiler
Error:and without specifying any "-target" type options. The consequence of ignoring
Error:this warning is that reflective operations on this class will incorrectly
Error:indicate that it is *not* an inner class.
Error⚠ Ignoring InnerClasses attribute for an anonymous inner class
Error:(com.umeng.socialize.view.e) that doesn't come with an
Error:associated EnclosingMethod attribute. This class was probably produced by a
Error:compiler that did not target the modern .class file format. The recommended
Error:solution is to recompile the class from source, using an up-to-date compiler
Error:and without specifying any "-target" type options. The consequence of ignoring
Error:this warning is that reflective operations on this class will incorrectly
Error:indicate that it is *not* an inner class.
Error⚠ Ignoring InnerClasses attribute for an anonymous inner class
Error:(com.umeng.socialize.view.k) that doesn't come with an
Error:associated EnclosingMethod attribute. This class was probably produced by a
Error:compiler that did not target the modern .class file format. The recommended
Error:solution is to recompile the class from source, using an up-to-date compiler
Error:and without specifying any "-target" type options. The consequence of ignoring
Error:this warning is that reflective operations on this class will incorrectly
Error:indicate that it is *not* an inner class.
Error⚠ Ignoring InnerClasses attribute for an anonymous inner class
Error:(com.umeng.socialize.view.l) that doesn't come with an
Error:associated EnclosingMethod attribute. This class was probably produced by a
Error:compiler that did not target the modern .class file format. The recommended
Error:solution is to recompile the class from source, using an up-to-date compiler
Error:and without specifying any "-target" type options. The consequence of ignoring
Error:this warning is that reflective operations on this class will incorrectly
Error:indicate that it is *not* an inner class.
Error⚠ Ignoring InnerClasses attribute for an anonymous inner class
Error:(com.umeng.socialize.view.n) that doesn't come with an
Error:associated EnclosingMethod attribute. This class was probably produced by a
Error:compiler that did not target the modern .class file format. The recommended
Error:solution is to recompile the class from source, using an up-to-date compiler
Error:and without specifying any "-target" type options. The consequence of ignoring
Error:this warning is that reflective operations on this class will incorrectly
Error:indicate that it is *not* an inner class.
Error⚠ Ignoring InnerClasses attribute for an anonymous inner class
Error:(com.umeng.socialize.view.p) that doesn't come with an
Error:associated EnclosingMethod attribute. This class was probably produced by a
Error:compiler that did not target the modern .class file format. The recommended
Error:solution is to recompile the class from source, using an up-to-date compiler
Error:and without specifying any "-target" type options. The consequence of ignoring
Error:this warning is that reflective operations on this class will incorrectly
Error:indicate that it is *not* an inner class.
Error⚠ Ignoring InnerClasses attribute for an anonymous inner class
Error:(com.umeng.socialize.view.r) that doesn't come with an
Error:associated EnclosingMethod attribute. This class was probably produced by a
Error:compiler that did not target the modern .class file format. The recommended
Error:solution is to recompile the class from source, using an up-to-date compiler
Error:and without specifying any "-target" type options. The consequence of ignoring
Error:this warning is that reflective operations on this class will incorrectly
Error:indicate that it is *not* an inner class.
Error⚠ Ignoring InnerClasses attribute for an anonymous inner class
Error:(com.umeng.socialize.view.x) that doesn't come with an
Error:associated EnclosingMethod attribute. This class was probably produced by a
Error:compiler that did not target the modern .class file format. The recommended
Error:solution is to recompile the class from source, using an up-to-date compiler
Error:and without specifying any "-target" type options. The consequence of ignoring
Error:this warning is that reflective operations on this class will incorrectly
Error:indicate that it is *not* an inner class.
Error⚠ Ignoring InnerClasses attribute for an anonymous inner class
Error:(com.umeng.socialize.view.y) that doesn't come with an
Error:associated EnclosingMethod attribute. This class was probably produced by a
Error:compiler that did not target the modern .class file format. The recommended
Error:solution is to recompile the class from source, using an up-to-date compiler
Error:and without specifying any "-target" type options. The consequence of ignoring
Error:this warning is that reflective operations on this class will incorrectly
Error:indicate that it is *not* an inner class.
Error⚠ Ignoring InnerClasses attribute for an anonymous inner class
Error:(com.umeng.socialize.view.z) that doesn't come with an
Error:associated EnclosingMethod attribute. This class was probably produced by a
Error:compiler that did not target the modern .class file format. The recommended
Error:solution is to recompile the class from source, using an up-to-date compiler
Error:and without specifying any "-target" type options. The consequence of ignoring
Error:this warning is that reflective operations on this class will incorrectly
Error:indicate that it is *not* an inner class.
Error⚠ Ignoring InnerClasses attribute for an anonymous inner class
Error:(com.umeng.socialize.view.s) that doesn't come with an
Error:associated EnclosingMethod attribute. This class was probably produced by a
Error:compiler that did not target the modern .class file format. The recommended
Error:solution is to recompile the class from source, using an up-to-date compiler
Error:and without specifying any "-target" type options. The consequence of ignoring
Error:this warning is that reflective operations on this class will incorrectly
Error:indicate that it is *not* an inner class.
Error⚠ Ignoring InnerClasses attribute for an anonymous inner class
Error:(com.umeng.socialize.view.t) that doesn't come with an
Error:associated EnclosingMethod attribute. This class was probably produced by a
Error:compiler that did not target the modern .class file format. The recommended
Error:solution is to recompile the class from source, using an up-to-date compiler
Error:and without specifying any "-target" type options. The consequence of ignoring
Error:this warning is that reflective operations on this class will incorrectly
Error:indicate that it is *not* an inner class.
Error⚠ Ignoring InnerClasses attribute for an anonymous inner class
Error:(com.umeng.socialize.view.u) that doesn't come with an
Error:associated EnclosingMethod attribute. This class was probably produced by a
Error:compiler that did not target the modern .class file format. The recommended
Error:solution is to recompile the class from source, using an up-to-date compiler
Error:and without specifying any "-target" type options. The consequence of ignoring
Error:this warning is that reflective operations on this class will incorrectly
Error:indicate that it is *not* an inner class.
Error⚠ Ignoring InnerClasses attribute for an anonymous inner class
Error:(com.umeng.socialize.view.v) that doesn't come with an
Error:associated EnclosingMethod attribute. This class was probably produced by a
Error:compiler that did not target the modern .class file format. The recommended
Error:solution is to recompile the class from source, using an up-to-date compiler
Error:and without specifying any "-target" type options. The consequence of ignoring
Error:this warning is that reflective operations on this class will incorrectly
Error:indicate that it is *not* an inner class.
Error⚠ Ignoring InnerClasses attribute for an anonymous inner class
Error:(com.umeng.socialize.view.w) that doesn't come with an
Error:associated EnclosingMethod attribute. This class was probably produced by a
Error:compiler that did not target the modern .class file format. The recommended
Error:solution is to recompile the class from source, using an up-to-date compiler
Error:and without specifying any "-target" type options. The consequence of ignoring
Error:this warning is that reflective operations on this class will incorrectly
Error:indicate that it is *not* an inner class.
Error⚠ Ignoring InnerClasses attribute for an anonymous inner class
Error:(com.hp.hpl.sparta.Node$1) that doesn't come with an
Error:associated EnclosingMethod attribute. This class was probably produced by a
Error:compiler that did not target the modern .class file format. The recommended
Error:solution is to recompile the class from source, using an up-to-date compiler
Error:and without specifying any "-target" type options. The consequence of ignoring
Error:this warning is that reflective operations on this class will incorrectly
Error:indicate that it is *not* an inner class.
Error⚠ Ignoring InnerClasses attribute for an anonymous inner class
Error:(com.hp.hpl.sparta.Sparta$2) that doesn't come with an
Error:associated EnclosingMethod attribute. This class was probably produced by a
Error:compiler that did not target the modern .class file format. The recommended
Error:solution is to recompile the class from source, using an up-to-date compiler
Error:and without specifying any "-target" type options. The consequence of ignoring
Error:this warning is that reflective operations on this class will incorrectly
Error:indicate that it is *not* an inner class.
Error⚠ Ignoring InnerClasses attribute for an anonymous inner class
Error:(com.hp.hpl.sparta.Sparta$1) that doesn't come with an
Error:associated EnclosingMethod attribute. This class was probably produced by a
Error:compiler that did not target the modern .class file format. The recommended
Error:solution is to recompile the class from source, using an up-to-date compiler
Error:and without specifying any "-target" type options. The consequence of ignoring
Error:this warning is that reflective operations on this class will incorrectly
Error:indicate that it is *not* an inner class.
Error⚠ Ignoring InnerClasses attribute for an anonymous inner class
Error:(com.tencent.mm.sdk.b.b) that doesn't come with an
Error:associated EnclosingMethod attribute. This class was probably produced by a
Error:compiler that did not target the modern .class file format. The recommended
Error:solution is to recompile the class from source, using an up-to-date compiler
Error:and without specifying any "-target" type options. The consequence of ignoring
Error:this warning is that reflective operations on this class will incorrectly
Error:indicate that it is *not* an inner class.
Error⚠ Ignoring InnerClasses attribute for an anonymous inner class
Error:(com.tencent.mm.sdk.openapi.WXApiImplV10$ActivityLifecycleCb$1) that doesn't come with an
Error:associated EnclosingMethod attribute. This class was probably produced by a
Error:compiler that did not target the modern .class file format. The recommended
Error:solution is to recompile the class from source, using an up-to-date compiler
Error:and without specifying any "-target" type options. The consequence of ignoring
Error:this warning is that reflective operations on this class will incorrectly
Error:indicate that it is *not* an inner class.
Error⚠ Ignoring InnerClasses attribute for an anonymous inner class
Error:(com.tencent.mm.sdk.openapi.WXApiImplV10$ActivityLifecycleCb$2) that doesn't come with an
Error:associated EnclosingMethod attribute. This class was probably produced by a
Error:compiler that did not target the modern .class file format. The recommended
Error:solution is to recompile the class from source, using an up-to-date compiler
Error:and without specifying any "-target" type options. The consequence of ignoring
Error:this warning is that reflective operations on this class will incorrectly
Error:indicate that it is *not* an inner class.
Error:The number of method references in a .dex file cannot exceed 64K.
Learn how to resolve this issue at https://developer.android.com/tools/building/multidex.html
Error:Execution failed for task ':app:transformClassesWithDexForGoogleDebug'.
> com.android.build.api.transform.TransformException: com.android.ide.common.process.ProcessException: java.util.concurrent.ExecutionException: java.lang.UnsupportedOperationException
Information:BUILD FAILED
Information:Total time: 1 mins 15.279 secs
Information:1,266 errors
Information:0 warnings
Information:See complete output in console

加载中
0
飞越围墙
飞越围墙
Error:The number of method references in a .dex file cannot exceed 64K.
Learn how to resolve this issue at https://developer.android.com/tools/building/multidex.html
返回顶部
顶部