编译GCC4.8.2的时候出错

洲宝 发布于 2014/02/08 16:08
阅读 1K+
收藏 0

checking for x86_64-apple-darwin13.0.0-gcc... /Users/Mac/gcc-4.8.2/host-x86_64-apple-darwin13.0.0/gcc/xgcc -B/Users/Mac/gcc-4.8.2/host-x86_64-apple-darwin13.0.0/gcc/ -B/Users/Mac/GCC/x86_64-apple-darwin13.0.0/bin/ -B/Users/Mac/GCC/x86_64-apple-darwin13.0.0/lib/ -isystem /Users/Mac/GCC/x86_64-apple-darwin13.0.0/include -isystem /Users/Mac/GCC/x86_64-apple-darwin13.0.0/sys-include   

checking for suffix of object files... configure: error: in `/Users/Mac/gcc-4.8.2/x86_64-apple-darwin13.0.0/libgcc':

configure: error: cannot compute suffix of object files: cannot compile

See `config.log' for more details.

make[2]: *** [configure-stage1-target-libgcc] Error 1

make[1]: *** [stage1-bubble] Error 2

make: *** [all] Error 2

加载中
0
洲宝
洲宝
这个是沉了啊啊啊啊啊
返回顶部
顶部