1
回答
JsonMapper.java:141: 无法确定 <T>T 的类型参数 ;对于上限为 T,java.lang.Object 的类型变量 T,不存在唯一最大实例
利用AWS快速构建适用于生产的无服务器应用程序,免费试用12个月>>>   

@江南白衣 你好,想跟你请教个问题:

[INFO] BUILD FAILURE
[INFO] ------------------------------------------------------------------------
[INFO] Total time: 6.172s
[INFO] Finished at: Wed Sep 11 15:43:18 CST 2013
[INFO] Final Memory: 20M/123M
[INFO] ------------------------------------------------------------------------
[ERROR] Failed to execute goal org.apache.maven.plugins:maven-compiler-plugin:3.1:compile
(default-compile) on project springside-core: Compilation failure
[ERROR] /E:/JavaWorkspace/springside4-4.1.0.GA/modules/core/src/main/java/org/springside/m
odules/mapper/JsonMapper.java:[141,74] E:\JavaWorkspace\springside4-4.1.0.GA\modules\core\
src\main\java\org\springside\modules\mapper\JsonMapper.java:141: 无法确定 <T>T 的类型参数
;对于上限为 T,java.lang.Object 的类型变量 T,不存在唯一最大实例
[ERROR] -> [Help 1]
[ERROR]
[ERROR] To see the full stack trace of the errors, re-run Maven with the -e switch.
[ERROR] Re-run Maven using the -X switch to enable full debug logging.
[ERROR]
[ERROR] For more information about the errors and possible solutions, please read the foll
owing articles:
[ERROR] [Help 1] http://cwiki.apache.org/confluence/display/MAVEN/MojoFailureException
[ERROR]
[ERROR] After correcting the problems, you can resume the build with the command
[ERROR]   mvn <goals> -rf :springside-core
Error Happen!!
请按任意键继续. . .


怎么解决( java version "1.6.0_22")?


举报
徒伤悲
发帖于4年前 1回/7K+阅
顶部