spiderman2执行.bat成功,使用eclipse却出现下面报错

dear刺猬阿莫 发布于 2016/04/27 20:49
阅读 838
收藏 0


@自风 想请教一下,这是什么情况?

Results :

Tests run: 0, Failures: 0, Errors: 0, Skipped: 0

 

[INFO] ------------------------------------------------------------------------

[INFO] BUILD FAILURE

[INFO] ------------------------------------------------------------------------

[INFO] Total time: 39:19 min

[INFO] Finished at: 2016-04-27T20:03:47+08:00

[INFO] Final Memory: 12M/90M

[INFO] ------------------------------------------------------------------------

[ERROR] Failed to execute goal org.apache.maven.plugins:maven-surefire-plugin:2.12.4:test (default-test) on project spiderman: Execution default-test of goal org.apache.maven.plugins:maven-surefire-plugin:2.12.4:test failed: The forked VM terminated without saying properly goodbye. VM crash or System.exit called ? -> [Help 1]

[ERROR]

[ERROR] To see the full stack trace of the errors, re-run Maven with the -e switch.

[ERROR] Re-run Maven using the -X switch to enable full debug logging.

[ERROR]

[ERROR] For more information about the errors and possible solutions, please read the following articles:

[ERROR] [Help 1] http://cwiki.apache.org/confluence/display/MAVEN/PluginExecutionException

加载中
0
w
wanwan0616
招聘Java开发,杭州、广州、大连
法资企业
诚聘Java工程师,tester(功能),项目稳定
要求:
1、英语或者日语。
2、1~10年工作经验皆可
薪资构成,(base薪资+补贴)*13薪+年奖
加班很少、福利好
微信779456235

0
自风
自风
没明白。
返回顶部
顶部