Qt make 时出现错误

TheHunter大举 发布于 2017/05/06 16:32
阅读 544
收藏 0

  1 ../JavaScriptCore/runtime/UString.h:294:48:   required from here
  2 ../JavaScriptCore/wtf/RefPtr.h:57:69: error: ‘adoptRef’ was not declared in     this scope, and no declarations were found by argument-dependent lookup at t    he point of instantiation [-fpermissive]
  3 In file included from ../JavaScriptCore/runtime/UString.h:30:0,
  4   from ../JavaScriptCore/API/OpaqueJSString.h:29,
  5   from ../JavaScriptCore/API/JSBase.cpp:3    2:
  6./JavaScriptCore/wtf/PassRefPtr.h:168:    48: note: ‘template<class T> WTF::PassRefPtr<T> WTF::adoptRef(T*)’ declared     here, later in the translation unit
  7  Makefile:6139: recipe for target '.obj/    release-shared-emb-arm/JSBase.o' failed
  8  make[1]: *** [.obj/release-shared-emb-a    rm/JSBase.o] Error 1
  9 make[1]: Leaving directory '/home/djwei    /files/qt-embedded-linux-opensource-src-4.5.3/src/3rdparty/webkit/WebCore'
 10 Makefile:484: recipe for target 'sub-we    bkit-make_default-ordered' failed
 11 make: *** [sub-webkit-make_default-orde    red] Error 2

 

加载中
0
T
TheHunter大举

执行下apt-get install qt4-*

装完重启

返回顶部
顶部