grails 测试程序出错

cherylLee 发布于 2015/11/03 17:37
阅读 259
收藏 0

【Gopher China万字分享】华为云的Go语言云原生实战经验!>>>

在编写好测试类后,运行grails test-app 提示出如下错误:

FAILURE: Build failed with an exception.


* What went wrong:
Task 'test' not found in root project 'GDepot'.


* Try:
Run gradle tasks to get a list of available tasks. Run with --stacktrace option to get the stack trace. Run with --info or --debug option to get more log output.


BUILD FAILED


Total time: 0.751 secs
| Tests FAILED Test execution failed


加载中
返回顶部
顶部