1
回答
部署点评Cat监控项目,使用maven编译CAT找不到org.unidal.maven.plugins:codegen-maven-plugin:2.3.2
注册华为云得mate10,2.9折抢先购!>>>   
[INFO] ------------------------------------------------------------------------
[INFO] Reactor Summary:
[INFO] 
[INFO] parent ............................................. SUCCESS [  1.272 s]
[INFO] cat-client ......................................... FAILURE [  5.622 s]
[INFO] cat-core ........................................... SKIPPED
[INFO] cat-hadoop ......................................... SKIPPED
[INFO] cat-consumer ....................................... SKIPPED
[INFO] cat-home ........................................... SKIPPED
[INFO] cat-maven-plugin ................................... SKIPPED
[INFO] ------------------------------------------------------------------------
[INFO] BUILD FAILURE
[INFO] ------------------------------------------------------------------------
[INFO] Total time: 7.306 s
[INFO] Finished at: 2016-03-03T10:09:09+08:00
[INFO] Final Memory: 8M/20M
[INFO] ------------------------------------------------------------------------
[ERROR] Plugin org.unidal.maven.plugins:codegen-maven-plugin:2.3.2 or one of its dependencies could not be resolved: Failed to read artifact descriptor for org.unidal.maven.plugins:codegen-maven-plugin:jar:2.3.2: 1 problem was encountered while building the effective model
<无标签>
举报
Pyoung
发帖于2年前 1回/2K+阅

以下是问题补充:

  • @Pyoung :寻觅千百度,找不到一个答案,求大神解答,谢谢~ (2年前)
顶部