IDEA 新建maven-archetypes-webapp报错

懒惰的兔子 发布于 2015/06/28 15:37
阅读 5K+
收藏 0
"C:\Program Files\Java\jdk1.7.0_17\bin\java" -Dclassworlds.conf=D:\apache-maven-3.2.3\bin\m2.conf -Dmaven.home=D:\apache-maven-3.2.3 -Dfile.encoding=UTF-8 -classpath D:\apache-maven-3.2.3\boot\plexus-classworlds-2.5.1.jar org.codehaus.classworlds.Launcher --no-plugin-registry --fail-fast --strict-checksums --update-snapshots -DinteractiveMode=false -DgroupId=com.zjw -DartifactId=SpringMVCDemo -Dversion=1.0-SNAPSHOT -DarchetypeGroupId=org.apache.maven.archetypes -DarchetypeArtifactId=maven-archetype-webapp -DarchetypeVersion=RELEASE org.apache.maven.plugins:maven-archetype-plugin:RELEASE:generate
[WARNING] Command line option -npr is deprecated and will be removed in future Maven versions.
[INFO] Scanning for projects...
Downloading: https://repo.maven.apache.org/maven2/org/apache/maven/plugins/maven-archetype-plugin/maven-metadata.xml
Downloaded: https://repo.maven.apache.org/maven2/org/apache/maven/plugins/maven-archetype-plugin/maven-metadata.xml (730 B at 0.1 KB/sec)
[INFO]                                                                         
[INFO] ------------------------------------------------------------------------
[INFO] Building Maven Stub Project (No POM) 1
[INFO] ------------------------------------------------------------------------
[INFO] 
[INFO] >>> maven-archetype-plugin:2.3:generate (default-cli) > generate-sources @ standalone-pom >>>
[INFO] 
[INFO] <<< maven-archetype-plugin:2.3:generate (default-cli) < generate-sources @ standalone-pom <<<
[INFO] 
[INFO] --- maven-archetype-plugin:2.3:generate (default-cli) @ standalone-pom ---
[INFO] ------------------------------------------------------------------------
[INFO] BUILD FAILURE
[INFO] ------------------------------------------------------------------------
[INFO] Total time: 8.069 s
[INFO] Finished at: 2015-06-28T15:33:19+08:00
[INFO] Final Memory: 8M/152M
[INFO] ------------------------------------------------------------------------
[ERROR] Internal error: java.lang.ArrayIndexOutOfBoundsException: 8192 -> [Help 1]
org.apache.maven.InternalErrorException: Internal error: java.lang.ArrayIndexOutOfBoundsException: 8192
at org.apache.maven.lifecycle.internal.builder.BuilderCommon.handleBuildError(BuilderCommon.java:147)
at org.apache.maven.lifecycle.internal.LifecycleModuleBuilder.buildProject(LifecycleModuleBuilder.java:129)
at org.apache.maven.lifecycle.internal.LifecycleModuleBuilder.buildProject(LifecycleModuleBuilder.java:80)
at org.apache.maven.lifecycle.internal.builder.singlethreaded.SingleThreadedBuilder.build(SingleThreadedBuilder.java:51)
at org.apache.maven.lifecycle.internal.LifecycleStarter.execute(LifecycleStarter.java:120)
at org.apache.maven.DefaultMaven.doExecute(DefaultMaven.java:347)
at org.apache.maven.DefaultMaven.execute(DefaultMaven.java:154)
at org.apache.maven.cli.MavenCli.execute(MavenCli.java:582)
at org.apache.maven.cli.MavenCli.doMain(MavenCli.java:214)
at org.apache.maven.cli.MavenCli.main(MavenCli.java:158)
at sun.reflect.NativeMethodAccessorImpl.invoke0(Native Method)
at sun.reflect.NativeMethodAccessorImpl.invoke(NativeMethodAccessorImpl.java:57)
at sun.reflect.DelegatingMethodAccessorImpl.invoke(DelegatingMethodAccessorImpl.java:43)
at java.lang.reflect.Method.invoke(Method.java:601)
at org.codehaus.plexus.classworlds.launcher.Launcher.launchEnhanced(Launcher.java:289)
at org.codehaus.plexus.classworlds.launcher.Launcher.launch(Launcher.java:229)
at org.codehaus.plexus.classworlds.launcher.Launcher.mainWithExitCode(Launcher.java:415)
at org.codehaus.plexus.classworlds.launcher.Launcher.main(Launcher.java:356)
at org.codehaus.classworlds.Launcher.main(Launcher.java:46)
Caused by: java.lang.ArrayIndexOutOfBoundsException: 8192
at org.codehaus.plexus.util.xml.pull.MXParser.parsePI(MXParser.java:2496)
at org.codehaus.plexus.util.xml.pull.MXParser.nextImpl(MXParser.java:1283)
at org.codehaus.plexus.util.xml.pull.MXParser.next(MXParser.java:1131)
at org.codehaus.plexus.util.xml.pull.MXParser.nextText(MXParser.java:1096)
at org.apache.maven.model.io.xpp3.MavenXpp3Reader.parseDeploymentRepository(MavenXpp3Reader.java:1474)
at org.apache.maven.model.io.xpp3.MavenXpp3Reader.parseDistributionManagement(MavenXpp3Reader.java:1621)
at org.apache.maven.model.io.xpp3.MavenXpp3Reader.parseModel(MavenXpp3Reader.java:2174)
at org.apache.maven.model.io.xpp3.MavenXpp3Reader.read(MavenXpp3Reader.java:3807)
at org.apache.maven.model.io.xpp3.MavenXpp3Reader.read(MavenXpp3Reader.java:557)
at org.apache.maven.model.io.DefaultModelReader.read(DefaultModelReader.java:122)
at org.apache.maven.model.io.DefaultModelReader.read(DefaultModelReader.java:91)
at org.apache.maven.model.building.DefaultModelProcessor.read(DefaultModelProcessor.java:77)
at org.apache.maven.model.building.DefaultModelBuilder.readModel(DefaultModelBuilder.java:483)
at org.apache.maven.model.building.DefaultModelBuilder.readParentExternally(DefaultModelBuilder.java:945)
at org.apache.maven.model.building.DefaultModelBuilder.readParent(DefaultModelBuilder.java:750)
at org.apache.maven.model.building.DefaultModelBuilder.build(DefaultModelBuilder.java:309)
at org.apache.maven.repository.internal.DefaultArtifactDescriptorReader.loadPom(DefaultArtifactDescriptorReader.java:375)
at org.apache.maven.repository.internal.DefaultArtifactDescriptorReader.readArtifactDescriptor(DefaultArtifactDescriptorReader.java:231)
at org.eclipse.aether.internal.impl.DefaultDependencyCollector.process(DefaultDependencyCollector.java:461)
at org.eclipse.aether.internal.impl.DefaultDependencyCollector.process(DefaultDependencyCollector.java:573)
at org.eclipse.aether.internal.impl.DefaultDependencyCollector.collectDependencies(DefaultDependencyCollector.java:261)
at org.eclipse.aether.internal.impl.DefaultRepositorySystem.collectDependencies(DefaultRepositorySystem.java:317)
at org.apache.maven.plugin.internal.DefaultPluginDependenciesResolver.resolve(DefaultPluginDependenciesResolver.java:192)
at org.apache.maven.plugin.internal.DefaultMavenPluginManager.createPluginRealm(DefaultMavenPluginManager.java:359)
at org.apache.maven.plugin.internal.DefaultMavenPluginManager.setupPluginRealm(DefaultMavenPluginManager.java:327)
at org.apache.maven.plugin.DefaultBuildPluginManager.getPluginRealm(DefaultBuildPluginManager.java:229)
at org.apache.maven.plugin.DefaultBuildPluginManager.executeMojo(DefaultBuildPluginManager.java:100)
at org.apache.maven.lifecycle.internal.MojoExecutor.execute(MojoExecutor.java:208)
at org.apache.maven.lifecycle.internal.MojoExecutor.execute(MojoExecutor.java:153)
at org.apache.maven.lifecycle.internal.MojoExecutor.execute(MojoExecutor.java:145)
at org.apache.maven.lifecycle.internal.LifecycleModuleBuilder.buildProject(LifecycleModuleBuilder.java:116)
... 17 more
[ERROR] 
[ERROR] To see the full stack trace of the errors, re-run Maven with the -e switch.
[ERROR] Re-run Maven using the -X switch to enable full debug logging.
[ERROR] 
[ERROR] For more information about the errors and possible solutions, please read the following articles:
[ERROR] [Help 1] http://cwiki.apache.org/confluence/display/MAVEN/InternalErrorException

[ERROR] Maven execution terminated abnormally (exit code 1)

选择quickstart创建就没这问题,这是什么问题,求大神帮忙解决,感激不尽!

加载中
返回顶部
顶部