Failed to execute goal org.apache.maven.plugins:maven-war-plugin:2.2:war

知行合一1 发布于 2017/10/24 11:48
阅读 227
收藏 0

BUILD FAILURE
[INFO] ------------------------------------------------------------------------
[INFO] Total time: 9.605 s
[INFO] Finished at: 2017-10-24T11:48:17+08:00
[INFO] Final Memory: 15M/197M
[INFO] ------------------------------------------------------------------------
[ERROR] Failed to execute goal org.apache.maven.plugins:maven-war-plugin:2.2:war (default-war) on project Spring4Rest: Error assembling WAR: webxml attribute is required (or pre-existing WEB-INF/web.xml if executing in update mode) -> [Help 1]
[ERROR] 
 

加载中
返回顶部
顶部