1
回答
在mac 上安装aircrack-ng出现的问题。大神联系-2732278700@qq.com
终于搞明白,存储TCO原来是这样算的>>>   
i change the <endian.h> to <machine/endian.h>

another error occurred .



Kis-MacBook-Pro:~ KevinChu$ cd /Users/KevinChu/Desktop/aircrack-ng-1.2-rc1 
Kis-MacBook-Pro:aircrack-ng-1.2-rc1 KevinChu$ gmake
gmake -C src all
gmake[1]: Entering directory '/Users/KevinChu/Desktop/aircrack-ng-1.2-rc1/src'
gcc -g -W -Wall -O3 -D_FILE_OFFSET_BITS=64 -D_REVISION=0  -Iinclude  airdecloak-ng.o common.o osdep/radiotap/radiotap.o -o airdecloak-ng 
Undefined symbols for architecture x86_64:
  "_le16toh", referenced from:
      _ieee80211_radiotap_iterator_init in radiotap.o
      _ieee80211_radiotap_iterator_next in radiotap.o
  "_le32toh", referenced from:
      _ieee80211_radiotap_iterator_init in radiotap.o
      _ieee80211_radiotap_iterator_next in radiotap.o
ld: symbol(s) not found for architecture x86_64
clang: error: linker command failed with exit code 1 (use -v to see invocation)
Makefile:183: recipe for target 'airdecloak-ng' failed
gmake[1]: *** [airdecloak-ng] Error 1
gmake[1]: Leaving directory '/Users/KevinChu/Desktop/aircrack-ng-1.2-rc1/src'
Makefile:25: recipe for target 'all' failed
gmake: *** [all] Error 2
举报
sex
发帖于2年前 1回/442阅
顶部