koala项目初级阶段编译出错

爽歪歪的感觉 发布于 2014/04/15 13:17
阅读 788
收藏 0
刚重新构建了一个koala项目,其他的东西都配好了,构建项目后conf出错,但是没有指出具体的错误,还有在编译的时候报 [INFO] Reactor Summary:
[INFO] 
[INFO] conference ........................................ SUCCESS [0.393s]
[INFO] conference-conf ................................... FAILURE [1:10.802s]
[INFO] conference-core ................................... SKIPPED
[INFO] conference-application ............................ SKIPPED
[INFO] conference-infra .................................. SKIPPED
[INFO] conference-applicationImpl ........................ SKIPPED
[INFO] conference-web .................................... SKIPPED
[INFO] ------------------------------------------------------------------------
[INFO] BUILD FAILURE
[INFO] ------------------------------------------------------------------------
[INFO] Total time: 1:11.465s
[INFO] Finished at: Tue Apr 15 13:15:35 CST 2014
[INFO] Final Memory: 7M/20M
[INFO] ------------------------------------------------------------------------
[ERROR] Failed to execute goal org.apache.maven.plugins:maven-surefire-plugin:2.10:test (default-test) on project conference-conf: Execution default-test of goal org.apache.maven.plugins:maven-surefire-plugin:2.10:test failed: Plugin org.apache.maven.plugins:maven-surefire-plugin:2.10 or one of its dependencies could not be resolved: Failed to collect dependencies for org.apache.maven.plugins:maven-surefire-plugin🏺2.10 (): Failed to read artifact descriptor for org.codehaus.plexus:plexus-utils🏺2.1: Could not transfer artifact org.sonatype.forge:forge-parent:pom:5 from/to central (http://repo.maven.apache.org/maven2): connection timed out to http://repo.maven.apache.org/maven2/org/sonatype/forge/forge-parent/5/forge-parent-5.pom -> [Help 1]
[ERROR] 
[ERROR] To see the full stack trace of the errors, re-run Maven with the -e switch.
[ERROR] Re-run Maven using the -X switch to enable full debug logging.
[ERROR] 
[ERROR] For more information about the errors and possible solutions, please read the following articles:
[ERROR]  [Help 1] http://cwiki.apache.org/confluence/display/MAVEN/PluginResolutionException
[ERROR] 
[ERROR] After correcting the problems, you can resume the build with the command
[ERROR]   mvn <goals> -rf :conference-conf

加载中
0
Koala_考拉
Koala_考拉

connection timed out to http://repo.maven.apache.org 网络问题,重试几次

0
爽歪歪的感觉

什么意思啊,是叫我在命令行这样吗?

返回顶部
顶部