spiderman-plugin构建不成功!

刘草 发布于 2013/09/19 21:39
阅读 982
收藏 0

@自风 你好,想跟你请教个问题:

下载的你的那个spiderman的maven项目,导入到myeclipse后   在构建spiderman-plugin的时候出现下面的错,其他的都正常,就这个一直下载不了!

我把这个下载链接:https://oss.sonatype.org/service/local/staging/deploy/maven2/org/eweb4j/spiderman-parent/0.1.0-SNAPSHOT/maven-metadata.xml

复制到浏览器的时间,就会提示要登录。请问这要怎么解决啊?谢谢!

[INFO] ------------------------------------------------------------------------
[INFO] Building spiderman-plugin 0.1.0-SNAPSHOT
[INFO] ------------------------------------------------------------------------
SLF4J: Failed to load class "org.slf4j.impl.StaticLoggerBinder".
SLF4J: Defaulting to no-operation (NOP) logger implementation
SLF4J: See http://www.slf4j.org/codes.html#StaticLoggerBinder for further details.
Downloading: https://oss.sonatype.org/service/local/staging/deploy/maven2/org/eweb4j/spiderman-parent/0.1.0-SNAPSHOT/maven-metadata.xml
[WARNING] Could not transfer metadata org.eweb4j:spiderman-parent:0.1.0-SNAPSHOT/maven-metadata.xml from/to nexus-releases (https://oss.sonatype.org/service/local/staging/deploy/maven2): Access denied to https://oss.sonatype.org/service/local/staging/deploy/maven2/org/eweb4j/spiderman-parent/0.1.0-SNAPSHOT/maven-metadata.xml. Error code 401, Unauthorized
Downloading: https://oss.sonatype.org/service/local/staging/deploy/maven2/org/eweb4j/spiderman-parent/0.1.0-SNAPSHOT/spiderman-parent-0.1.0-SNAPSHOT.pom
[INFO] ------------------------------------------------------------------------
[INFO] BUILD FAILURE
[INFO] ------------------------------------------------------------------------
[INFO] Total time: 4.636s
[INFO] Finished at: Thu Sep 19 21:34:37 CST 2013
[INFO] Final Memory: 3M/6M
[INFO] ------------------------------------------------------------------------
[ERROR] Failed to execute goal on project spiderman-plugin: Could not resolve dependencies for project org.eweb4j:spiderman-plugin🏺0.1.0-SNAPSHOT: Failed to collect dependencies for [org.eweb4j:spiderman-core🏺0.1.0-SNAPSHOT (compile), com.sleepycat:je🏺4.0.92 (compile), org.eweb4j:fel🏺0.8 (compile), net.sf.saxon:Saxon-HE🏺9.4.0.6 (compile), org.apache.httpcomponents:httpclient🏺4.2 (compile), org.apache.httpcomponents:httpcore🏺4.2 (compile), org.apache.httpcomponents:httpmime🏺4.2 (compile), net.sourceforge.htmlcleaner:htmlcleaner🏺2.2 (compile), com.alibaba:fastjson🏺1.1.23 (compile)]: Failed to read artifact descriptor for org.eweb4j:spiderman-core🏺0.1.0-SNAPSHOT: Could not transfer artifact org.eweb4j:spiderman-parent:pom:0.1.0-SNAPSHOT from/to nexus-releases (https://oss.sonatype.org/service/local/staging/deploy/maven2): Access denied to https://oss.sonatype.org/service/local/staging/deploy/maven2/org/eweb4j/spiderman-parent/0.1.0-SNAPSHOT/spiderman-parent-0.1.0-SNAPSHOT.pom. Error code 401, Unauthorized -> [Help 1]
[ERROR] 
[ERROR] To see the full stack trace of the errors, re-run Maven with the -e switch.
[ERROR] Re-run Maven using the -X switch to enable full debug logging.
[ERROR] 
[ERROR] For more information about the errors and possible solutions, please read the following articles:
[ERROR] [Help 1] http://cwiki.apache.org/confluence/display/MAVEN/DependencyResolutionException

加载中
0
自风
自风
加我QQ 493781187,发一份构建好的给你。
刘草
刘草
OK THX
0
l
lvosc3mc
我也遇到同样问题呢
返回顶部
顶部