Flink 源码编译失败了,咋整好呀?

flink2c 发布于 03/31 22:09
阅读 70
收藏 0

 Flink : Table : Uber ............................... SUCCESS [  0.005 s]
[INFO] Flink : Table : Uber Blink ......................... SUCCESS [  0.008 s]
[INFO] Flink : Python ..................................... FAILURE [39:26 min]
[INFO] Flink : Table : SQL Client ......................... SKIPPED
[INFO] Flink : Libraries : State processor API ............ SKIPPED
[INFO] Flink : ML : ....................................... SKIPPED
[INFO] Flink : ML : API ................................... SKIPPED
[INFO] Flink : ML : Lib ................................... SKIPPED
[INFO] Flink : ML : Uber .................................. SKIPPED
[INFO] Flink : Scala shell ................................ SKIPPED
[INFO] Flink : Dist ....................................... SKIPPED
[INFO] Flink : Yarn Tests ................................. SKIPPED
[INFO] Flink : E2E Tests : ................................ SKIPPED
[INFO] Flink : E2E Tests : CLI ............................ SKIPPED
[INFO] Flink : E2E Tests : Parent Child classloading program SKIPPED
[INFO] Flink : E2E Tests : Parent Child classloading lib-package SKIPPED
[INFO] Flink : E2E Tests : Dataset allround ............... SKIPPED
[INFO] Flink : E2E Tests : Dataset Fine-grained recovery .. SKIPPED
[INFO] Flink : E2E Tests : Datastream allround ............ SKIPPED
[INFO] Flink : E2E Tests : Batch SQL ...................... SKIPPED
[INFO] Flink : E2E Tests : Stream SQL ..................... SKIPPED
[INFO] Flink : E2E Tests : Distributed cache via blob ..... SKIPPED
[INFO] Flink : E2E Tests : High parallelism iterations .... SKIPPED
[INFO] Flink : E2E Tests : Stream stateful job upgrade .... SKIPPED
[INFO] Flink : E2E Tests : Queryable state ................ SKIPPED
[INFO] Flink : E2E Tests : Local recovery and allocation .. SKIPPED
[INFO] Flink : E2E Tests : Elasticsearch 5 ................ SKIPPED
[INFO] Flink : E2E Tests : Elasticsearch 6 ................ SKIPPED
[INFO] Flink : Quickstart : ............................... SKIPPED
[INFO] Flink : Quickstart : Java .......................... SKIPPED
[INFO] Flink : Quickstart : Scala ......................... SKIPPED
[INFO] Flink : E2E Tests : Quickstart ..................... SKIPPED
[INFO] Flink : E2E Tests : Confluent schema registry ...... SKIPPED
[INFO] Flink : E2E Tests : Stream state TTL ............... SKIPPED
[INFO] Flink : E2E Tests : SQL client ..................... SKIPPED
[INFO] Flink : E2E Tests : File sink ...................... SKIPPED
[INFO] Flink : E2E Tests : State evolution ................ SKIPPED
[INFO] Flink : E2E Tests : RocksDB state memory control ... SKIPPED
[INFO] Flink : E2E Tests : Common ......................... SKIPPED
[INFO] Flink : E2E Tests : Metrics availability ........... SKIPPED
[INFO] Flink : E2E Tests : Metrics reporter prometheus .... SKIPPED
[INFO] Flink : E2E Tests : Heavy deployment ............... SKIPPED
[INFO] Flink : E2E Tests : Connectors : Google PubSub ..... SKIPPED
[INFO] Flink : E2E Tests : Streaming Kafka base ........... SKIPPED
[INFO] Flink : E2E Tests : Streaming Kafka ................ SKIPPED
[INFO] Flink : E2E Tests : Plugins : ...................... SKIPPED
[INFO] Flink : E2E Tests : Plugins : Dummy fs ............. SKIPPED
[INFO] Flink : E2E Tests : Plugins : Another dummy fs ..... SKIPPED
[INFO] Flink : E2E Tests : TPCH ........................... SKIPPED
[INFO] Flink : E2E Tests : Streaming Kinesis .............. SKIPPED
[INFO] Flink : E2E Tests : Elasticsearch 7 ................ SKIPPED
[INFO] Flink : E2E Tests : Common Kafka ................... SKIPPED
[INFO] Flink : E2E Tests : TPCDS .......................... SKIPPED
[INFO] Flink : E2E Tests : Netty shuffle memory control ... SKIPPED
[INFO] Flink : E2E Tests : Python ......................... SKIPPED
[INFO] Flink : E2E Tests : HBase .......................... SKIPPED
[INFO] Flink : State backends : Heap spillable ............ SKIPPED
[INFO] Flink : Contrib : .................................. SKIPPED
[INFO] Flink : Contrib : Connectors : Wikiedits ........... SKIPPED
[INFO] Flink : FileSystems : Tests ........................ SKIPPED
[INFO] Flink : Docs ....................................... SKIPPED
[INFO] Flink : Walkthrough : .............................. SKIPPED
[INFO] Flink : Walkthrough : Common ....................... SKIPPED
[INFO] Flink : Walkthrough : Datastream Java .............. SKIPPED
[INFO] Flink : Walkthrough : Datastream Scala ............. SKIPPED
[INFO] Flink : Tools : CI : Java .......................... SKIPPED
[INFO] ------------------------------------------------------------------------
[INFO] BUILD FAILURE
[INFO] ------------------------------------------------------------------------
[INFO] Total time:  40:10 min
[INFO] Finished at: 2021-03-31T21:48:43+08:00
[INFO] ------------------------------------------------------------------------
[ERROR] Failed to execute goal on project flink-python_2.11: Could not resolve dependencies for project org.apache.flink:flink-python_2.11🏺1.12-SNAPSHOT: The following artifacts could not be resolved: org.apache.flink:flink-table-planner_2.11🏺1.12-SNAPSHOT, org.apache.flink:flink-table-planner-blink_2.11🏺1.12-SNAPSHOT: Could not transfer artifact org.apache.flink:flink-table-planner_2.11🏺1.12-20210330.223045-320 from/to apache.snapshots (https://repository.apache.org/snapshots): GET request of: org/apache/flink/flink-table-planner_2.11/1.12-SNAPSHOT/flink-table-planner_2.11-1.12-20210330.223045-320.jar from apache.snapshots failed: Read timed out -> [Help 1]
[ERROR] 
[ERROR] To see the full stack trace of the errors, re-run Maven with the -e switch.
[ERROR] Re-run Maven using the -X switch to enable full debug logging.
[ERROR] 
[ERROR] For more information about the errors and possible solutions, please read the following articles:
[ERROR] [Help 1] http://cwiki.apache.org/confluence/display/MAVEN/DependencyResolutionException
[ERROR] 
[ERROR] After correcting the problems, you can resume the build with the command
[ERROR]   mvn <args> -rf :flink-python_2.11
 

加载中
OSCHINA
登录后可查看更多优质内容
返回顶部
顶部