maven编译失败了,] For more information about the errors and possible solutions, plea???

源1码1 发布于 01/31 08:31
阅读 477
收藏 0

 maven编译失败了,] For more information about the errors and possible solutions, please read the following articles:
[ERROR] [Help 1] http://cwiki.apache.org/confluence/display/MAVEN/MojoFailureException

 

o execute goal org.apache.maven.plugins:maven-surefire-plugin:2.12.4:test (default-test) on project hbase11xsqlreader: There are test failures.
[ERROR] 
[ERROR] Please refer to E:\code\DataX\o execute goal org.apache.maven.plugins:maven-surefire-plugin:2.12.4:test (default-test) on project hbase11xsqlreader: There are test failures.
[ERROR] 
[ERROR] Please refer to E:\code\DataX\hbase11xsqlreader\target\surefire-reports for the individual test results.
[ERROR] -> [Help 1]
[ERROR] 
[ERROR] To see the full stack trace of the errors, re-run Maven with the -e switch.
[ERROR] Re-run Maven using the -X switch to enable full debug logging.
[ERROR] 
[ERROR] For more information about the errors and possible solutions, please read the following articles:
[ERROR] [Help 1] http://cwiki.apache.org/confluence/display/MAVEN/MojoFailureException
[ERROR] 
[ERROR] To see the full stack trace of the errors, re-run Maven with the -e switch.
[ERROR] Re-run Maven using the -X switch to enable full debug logging.
[ERROR] 
[ERROR] For more information about the errors and possible solutions, please read the following articles:
[ERROR] [Help 1] http://cwiki.apache.org/confluence/display/MAVEN/MojoFailureException

 

加载中
0
源1码1
源1码1

Failed to execute goal org.apache.maven.plugins:maven-surefire-plugin:2.12.4:test (default-test) on project flinkx-core: There are test failures.

Please refer to E:\code\flinkx\flinkx-core\target\surefire-reports for the individual test results.
 

0
源1码1
源1码1

Process terminated
 

OSCHINA
登录后可查看更多优质内容
返回顶部
顶部