Could not find a valid Docker environment. Please see logs and check configuration

源码节点 发布于 02/04 17:41
阅读 484
收藏 0

【Gopher China万字分享】华为云的Go语言云原生实战经验!>>>

"C:\Program Files\Java\jdk1.8.0_191\bin\java.exe" -Dmaven.multiModuleProjectDirectory=D:\ra\flink-clickhouse-sink-master "-Dmaven.home=D:\Program Files\JetBrains\IntelliJ IDEA 2018.1.4\plugins\maven\lib\maven3" "-Dclassworlds.conf=D:\Program Files\JetBrains\IntelliJ IDEA 2018.1.4\plugins\maven\lib\maven3\bin\m2.conf" "-javaagent:D:\Program Files\JetBrains\IntelliJ IDEA 2018.1.4\lib\idea_rt.jar=56459:D:\Program Files\JetBrains\IntelliJ IDEA 2018.1.4\bin" -Dfile.encoding=UTF-8 -classpath "D:\Program Files\JetBrains\IntelliJ IDEA 2018.1.4\plugins\maven\lib\maven3\boot\plexus-classworlds-2.5.2.jar" org.codehaus.classworlds.Launcher -Didea.version=2018.1.4 install -f pom.xml
[INFO] Scanning for projects...
[INFO]                                                                         
[INFO] ------------------------------------------------------------------------
[INFO] Building Flink Clickhouse sink 1.0.0-SNAPSHOT
[INFO] ------------------------------------------------------------------------
Downloading: https://repo.maven.apache.org/maven2/org/apache/maven/plugins/maven-enforcer-plugin/1.2/maven-enforcer-plugin-1.2.pom
Downloaded: https://repo.maven.apache.org/maven2/org/apache/maven/plugins/maven-enforcer-plugin/1.2/maven-enforcer-plugin-1.2.pom (6 KB at 4.1 KB/sec)
Downloading: https://repo.maven.apache.org/maven2/org/apache/maven/enforcer/enforcer/1.2/enforcer-1.2.pom
Downloaded: https://repo.maven.apache.org/maven2/org/apache/maven/enforcer/enforcer/1.2/enforcer-1.2.pom (11 KB at 26.4 KB/sec)
Downloading: https://repo.maven.apache.org/maven2/org/apache/maven/plugins/maven-enforcer-plugin/1.2/maven-enforcer-plugin-1.2.jar
Downloaded: https://repo.maven.apache.org/maven2/org/apache/maven/plugins/maven-enforcer-plugin/1.2/maven-enforcer-plugin-1.2.jar (25 KB at 33.4 KB/sec)
Downloading: https://repo.maven.apache.org/maven2/org/apache/maven/plugins/maven-compiler-plugin/3.7.0/maven-compiler-plugin-3.7.0.pom
Downloaded: https://repo.maven.apache.org/maven2/org/apache/maven/plugins/maven-compiler-plugin/3.7.0/maven-compiler-plugin-3.7.0.pom (0 B at 0.0 KB/sec)
Downloading: https://repo.maven.apache.org/maven2/org/apache/maven/plugins/maven-compiler-plugin/3.7.0/maven-compiler-plugin-3.7.0.jar
Downloaded: https://repo.maven.apache.org/maven2/org/apache/maven/plugins/maven-compiler-plugin/3.7.0/maven-compiler-plugin-3.7.0.jar (0 B at 0.0 KB/sec)
Downloading: https://repo.maven.apache.org/maven2/org/apache/flink/flink-runtime_2.10/1.3.2/flink-runtime_2.10-1.3.2.jar
Downloading: https://repo.maven.apache.org/maven2/org/apache/flink/flink-clients_2.10/1.3.2/flink-clients_2.10-1.3.2.jar
Downloading: https://repo.maven.apache.org/maven2/org/apache/flink/flink-optimizer_2.10/1.3.2/flink-optimizer_2.10-1.3.2.jar
Downloading: https://repo.maven.apache.org/maven2/ru/yandex/clickhouse/clickhouse-jdbc/0.1.40/clickhouse-jdbc-0.1.40.jar
Downloading: https://repo.maven.apache.org/maven2/com/fasterxml/jackson/core/jackson-databind/2.7.3/jackson-databind-2.7.3.jar
Downloaded: https://repo.maven.apache.org/maven2/ru/yandex/clickhouse/clickhouse-jdbc/0.1.40/clickhouse-jdbc-0.1.40.jar (163 KB at 41.9 KB/sec)
Downloading: https://repo.maven.apache.org/maven2/com/fasterxml/jackson/core/jackson-core/2.7.3/jackson-core-2.7.3.jar
Downloaded: https://repo.maven.apache.org/maven2/org/apache/flink/flink-clients_2.10/1.3.2/flink-clients_2.10-1.3.2.jar (0 B at 0.0 KB/sec)
Downloading: https://repo.maven.apache.org/maven2/org/awaitility/awaitility/3.1.2/awaitility-3.1.2.jar
Downloaded: https://repo.maven.apache.org/maven2/org/awaitility/awaitility/3.1.2/awaitility-3.1.2.jar (101 KB at 12.4 KB/sec)
Downloading: https://repo.maven.apache.org/maven2/org/jmock/jmock-junit4/2.9.0/jmock-junit4-2.9.0.jar
Downloaded: https://repo.maven.apache.org/maven2/org/jmock/jmock-junit4/2.9.0/jmock-junit4-2.9.0.jar (8 KB at 0.9 KB/sec)
Downloading: https://repo.maven.apache.org/maven2/org/jmock/jmock/2.9.0/jmock-2.9.0.jar
Downloaded: https://repo.maven.apache.org/maven2/org/jmock/jmock/2.9.0/jmock-2.9.0.jar (100 KB at 9.9 KB/sec)
Downloading: https://repo.maven.apache.org/maven2/org/jmock/jmock-testjar/2.9.0/jmock-testjar-2.9.0.jar
Downloaded: https://repo.maven.apache.org/maven2/com/fasterxml/jackson/core/jackson-databind/2.7.3/jackson-databind-2.7.3.jar (1175 KB at 108.6 KB/sec)
Downloading: https://repo.maven.apache.org/maven2/cglib/cglib/3.2.8/cglib-3.2.8.jar
Downloaded: https://repo.maven.apache.org/maven2/org/jmock/jmock-testjar/2.9.0/jmock-testjar-2.9.0.jar (4 KB at 0.3 KB/sec)
Downloading: https://repo.maven.apache.org/maven2/org/apache/ant/ant/1.10.3/ant-1.10.3.jar
Downloaded: https://repo.maven.apache.org/maven2/com/fasterxml/jackson/core/jackson-core/2.7.3/jackson-core-2.7.3.jar (247 KB at 12.0 KB/sec)
Downloading: https://repo.maven.apache.org/maven2/org/apache/ant/ant-launcher/1.10.3/ant-launcher-1.10.3.jar
Downloaded: https://repo.maven.apache.org/maven2/org/apache/ant/ant-launcher/1.10.3/ant-launcher-1.10.3.jar (19 KB at 0.8 KB/sec)
Downloading: https://repo.maven.apache.org/maven2/org/ow2/asm/asm/6.2.1/asm-6.2.1.jar
Downloaded: https://repo.maven.apache.org/maven2/cglib/cglib/3.2.8/cglib-3.2.8.jar (301 KB at 12.8 KB/sec)
Downloading: https://repo.maven.apache.org/maven2/org/apache-extras/beanshell/bsh/2.0b6/bsh-2.0b6.jar
Downloaded: https://repo.maven.apache.org/maven2/org/ow2/asm/asm/6.2.1/asm-6.2.1.jar (111 KB at 3.7 KB/sec)
Downloading: https://repo.maven.apache.org/maven2/com/zaxxer/HikariCP/2.3.8/HikariCP-2.3.8.jar
Downloaded: https://repo.maven.apache.org/maven2/org/apache-extras/beanshell/bsh/2.0b6/bsh-2.0b6.jar (380 KB at 10.9 KB/sec)
Downloading: https://repo.maven.apache.org/maven2/org/testcontainers/clickhouse/1.9.1/clickhouse-1.9.1.jar
Downloaded: https://repo.maven.apache.org/maven2/org/testcontainers/clickhouse/1.9.1/clickhouse-1.9.1.jar (4 KB at 0.1 KB/sec)
Downloading: https://repo.maven.apache.org/maven2/org/testcontainers/testcontainers/1.9.1/testcontainers-1.9.1.jar
Downloaded: https://repo.maven.apache.org/maven2/com/zaxxer/HikariCP/2.3.8/HikariCP-2.3.8.jar (97 KB at 2.2 KB/sec)
Downloading: https://repo.maven.apache.org/maven2/org/slf4j/slf4j-ext/1.7.25/slf4j-ext-1.7.25.jar
Downloaded: https://repo.maven.apache.org/maven2/org/slf4j/slf4j-ext/1.7.25/slf4j-ext-1.7.25.jar (42 KB at 0.9 KB/sec)
Downloading: https://repo.maven.apache.org/maven2/org/jetbrains/annotations/15.0/annotations-15.0.jar
Downloaded: https://repo.maven.apache.org/maven2/org/jetbrains/annotations/15.0/annotations-15.0.jar (19 KB at 0.4 KB/sec)
Downloading: https://repo.maven.apache.org/maven2/javax/annotation/javax.annotation-api/1.3.1/javax.annotation-api-1.3.1.jar
Downloaded: https://repo.maven.apache.org/maven2/javax/annotation/javax.annotation-api/1.3.1/javax.annotation-api-1.3.1.jar (26 KB at 0.6 KB/sec)
Downloading: https://repo.maven.apache.org/maven2/javax/xml/bind/jaxb-api/2.3.0/jaxb-api-2.3.0.jar
Downloaded: https://repo.maven.apache.org/maven2/javax/xml/bind/jaxb-api/2.3.0/jaxb-api-2.3.0.jar (123 KB at 2.1 KB/sec)
Downloading: https://repo.maven.apache.org/maven2/org/rnorth/duct-tape/duct-tape/1.0.7/duct-tape-1.0.7.jar
Downloaded: https://repo.maven.apache.org/maven2/org/rnorth/duct-tape/duct-tape/1.0.7/duct-tape-1.0.7.jar (25 KB at 0.4 KB/sec)
Downloading: https://repo.maven.apache.org/maven2/org/rnorth/visible-assertions/visible-assertions/2.1.1/visible-assertions-2.1.1.jar
Downloaded: https://repo.maven.apache.org/maven2/org/rnorth/visible-assertions/visible-assertions/2.1.1/visible-assertions-2.1.1.jar (12 KB at 0.2 KB/sec)
Downloading: https://repo.maven.apache.org/maven2/net/java/dev/jna/jna/4.5.1/jna-4.5.1.jar
Downloaded: https://repo.maven.apache.org/maven2/net/java/dev/jna/jna/4.5.1/jna-4.5.1.jar (0 B at 0.0 KB/sec)
Downloading: https://repo.maven.apache.org/maven2/org/rnorth/tcp-unix-socket-proxy/1.0.2/tcp-unix-socket-proxy-1.0.2.jar
Downloaded: https://repo.maven.apache.org/maven2/org/rnorth/tcp-unix-socket-proxy/1.0.2/tcp-unix-socket-proxy-1.0.2.jar (8 KB at 0.1 KB/sec)
Downloading: https://repo.maven.apache.org/maven2/com/kohlschutter/junixsocket/junixsocket-native-common/2.0.4/junixsocket-native-common-2.0.4.jar
Downloaded: https://repo.maven.apache.org/maven2/com/kohlschutter/junixsocket/junixsocket-native-common/2.0.4/junixsocket-native-common-2.0.4.jar (28 KB at 0.4 KB/sec)
Downloading: https://repo.maven.apache.org/maven2/org/scijava/native-lib-loader/2.0.2/native-lib-loader-2.0.2.jar
Downloaded: https://repo.maven.apache.org/maven2/org/scijava/native-lib-loader/2.0.2/native-lib-loader-2.0.2.jar (17 KB at 0.3 KB/sec)
Downloading: https://repo.maven.apache.org/maven2/com/kohlschutter/junixsocket/junixsocket-common/2.0.4/junixsocket-common-2.0.4.jar
Downloaded: https://repo.maven.apache.org/maven2/com/kohlschutter/junixsocket/junixsocket-common/2.0.4/junixsocket-common-2.0.4.jar (18 KB at 0.3 KB/sec)
Downloading: https://repo.maven.apache.org/maven2/net/java/dev/jna/jna-platform/4.5.1/jna-platform-4.5.1.jar
Downloaded: https://repo.maven.apache.org/maven2/net/java/dev/jna/jna-platform/4.5.1/jna-platform-4.5.1.jar (0 B at 0.0 KB/sec)
Downloading: https://repo.maven.apache.org/maven2/org/testcontainers/jdbc/1.9.1/jdbc-1.9.1.jar
Downloaded: https://repo.maven.apache.org/maven2/org/testcontainers/jdbc/1.9.1/jdbc-1.9.1.jar (24 KB at 0.3 KB/sec)
Downloading: https://repo.maven.apache.org/maven2/org/testcontainers/database-commons/1.9.1/database-commons-1.9.1.jar
Downloaded: https://repo.maven.apache.org/maven2/org/apache/ant/ant/1.10.3/ant-1.10.3.jar (2155 KB at 31.4 KB/sec)
Downloading: https://repo.maven.apache.org/maven2/org/mockito/mockito-core/2.8.9/mockito-core-2.8.9.jar
Downloaded: https://repo.maven.apache.org/maven2/org/testcontainers/database-commons/1.9.1/database-commons-1.9.1.jar (9 KB at 0.1 KB/sec)
Downloading: https://repo.maven.apache.org/maven2/net/bytebuddy/byte-buddy-agent/1.6.14/byte-buddy-agent-1.6.14.jar
Downloaded: https://repo.maven.apache.org/maven2/net/bytebuddy/byte-buddy-agent/1.6.14/byte-buddy-agent-1.6.14.jar (42 KB at 0.6 KB/sec)
Downloaded: https://repo.maven.apache.org/maven2/org/mockito/mockito-core/2.8.9/mockito-core-2.8.9.jar (520 KB at 5.9 KB/sec)
Downloaded: https://repo.maven.apache.org/maven2/org/apache/flink/flink-optimizer_2.10/1.3.2/flink-optimizer_2.10-1.3.2.jar (2679 KB at 28.4 KB/sec)
Downloaded: https://repo.maven.apache.org/maven2/org/apache/flink/flink-runtime_2.10/1.3.2/flink-runtime_2.10-1.3.2.jar (0 B at 0.0 KB/sec)
Downloaded: https://repo.maven.apache.org/maven2/org/testcontainers/testcontainers/1.9.1/testcontainers-1.9.1.jar (16772 KB at 36.0 KB/sec)
[INFO] 
[INFO] --- maven-enforcer-plugin:1.2:enforce (enforce-maven) @ flink-clickhouse-sink ---
Downloading: https://repo.maven.apache.org/maven2/org/apache/maven/enforcer/enforcer-api/1.2/enforcer-api-1.2.pom
Downloaded: https://repo.maven.apache.org/maven2/org/apache/maven/enforcer/enforcer-api/1.2/enforcer-api-1.2.pom (3 KB at 7.1 KB/sec)
Downloading: https://repo.maven.apache.org/maven2/org/apache/maven/enforcer/enforcer-rules/1.2/enforcer-rules-1.2.pom
Downloaded: https://repo.maven.apache.org/maven2/org/apache/maven/enforcer/enforcer-rules/1.2/enforcer-rules-1.2.pom (4 KB at 1.6 KB/sec)
Downloading: https://repo.maven.apache.org/maven2/org/apache/maven/shared/maven-common-artifact-filters/1.2/maven-common-artifact-filters-1.2.pom
Downloaded: https://repo.maven.apache.org/maven2/org/apache/maven/shared/maven-common-artifact-filters/1.2/maven-common-artifact-filters-1.2.pom (5 KB at 10.9 KB/sec)
Downloading: https://repo.maven.apache.org/maven2/org/apache/maven/shared/maven-shared-components/11/maven-shared-components-11.pom
Downloaded: https://repo.maven.apache.org/maven2/org/apache/maven/shared/maven-shared-components/11/maven-shared-components-11.pom (9 KB at 13.4 KB/sec)
Downloading: https://repo.maven.apache.org/maven2/org/apache/maven/shared/maven-dependency-tree/2.0/maven-dependency-tree-2.0.pom
Downloaded: https://repo.maven.apache.org/maven2/org/apache/maven/shared/maven-dependency-tree/2.0/maven-dependency-tree-2.0.pom (5 KB at 3.6 KB/sec)
Downloading: https://repo.maven.apache.org/maven2/org/codehaus/plexus/plexus-i18n/1.0-beta-6/plexus-i18n-1.0-beta-6.pom
Downloaded: https://repo.maven.apache.org/maven2/org/codehaus/plexus/plexus-i18n/1.0-beta-6/plexus-i18n-1.0-beta-6.pom (771 B at 0.8 KB/sec)
Downloading: https://repo.maven.apache.org/maven2/org/codehaus/plexus/plexus-components/1.1.4/plexus-components-1.1.4.pom
Downloaded: https://repo.maven.apache.org/maven2/org/codehaus/plexus/plexus-components/1.1.4/plexus-components-1.1.4.pom (3 KB at 5.0 KB/sec)
Downloading: https://repo.maven.apache.org/maven2/org/apache/maven/doxia/doxia-sink-api/1.0-alpha-10/doxia-sink-api-1.0-alpha-10.jar
Downloading: https://repo.maven.apache.org/maven2/org/apache/maven/shared/maven-common-artifact-filters/1.2/maven-common-artifact-filters-1.2.jar
Downloading: https://repo.maven.apache.org/maven2/org/apache/maven/shared/maven-dependency-tree/2.0/maven-dependency-tree-2.0.jar
Downloading: https://repo.maven.apache.org/maven2/org/apache/maven/enforcer/enforcer-api/1.2/enforcer-api-1.2.jar
Downloading: https://repo.maven.apache.org/maven2/org/apache/maven/enforcer/enforcer-rules/1.2/enforcer-rules-1.2.jar
Downloaded: https://repo.maven.apache.org/maven2/org/apache/maven/enforcer/enforcer-api/1.2/enforcer-api-1.2.jar (10 KB at 23.3 KB/sec)
Downloading: https://repo.maven.apache.org/maven2/org/codehaus/plexus/plexus-i18n/1.0-beta-6/plexus-i18n-1.0-beta-6.jar
Downloaded: https://repo.maven.apache.org/maven2/org/apache/maven/doxia/doxia-sink-api/1.0-alpha-10/doxia-sink-api-1.0-alpha-10.jar (10 KB at 12.6 KB/sec)
Downloaded: https://repo.maven.apache.org/maven2/org/codehaus/plexus/plexus-i18n/1.0-beta-6/plexus-i18n-1.0-beta-6.jar (12 KB at 14.6 KB/sec)
Downloaded: https://repo.maven.apache.org/maven2/org/apache/maven/shared/maven-dependency-tree/2.0/maven-dependency-tree-2.0.jar (55 KB at 41.2 KB/sec)
Downloaded: https://repo.maven.apache.org/maven2/org/apache/maven/shared/maven-common-artifact-filters/1.2/maven-common-artifact-filters-1.2.jar (31 KB at 19.9 KB/sec)
Downloaded: https://repo.maven.apache.org/maven2/org/apache/maven/enforcer/enforcer-rules/1.2/enforcer-rules-1.2.jar (75 KB at 47.0 KB/sec)
[INFO] 
[INFO] --- maven-resources-plugin:2.6:resources (default-resources) @ flink-clickhouse-sink ---
[INFO] Using 'UTF-8' encoding to copy filtered resources.
[INFO] skip non existing resourceDirectory D:\ra\flink-clickhouse-sink-master\src\main\resources
[INFO] 
[INFO] --- maven-compiler-plugin:3.7.0:compile (default-compile) @ flink-clickhouse-sink ---
Downloading: https://repo.maven.apache.org/maven2/org/codehaus/plexus/plexus-java/0.9.2/plexus-java-0.9.2.pom
Downloaded: https://repo.maven.apache.org/maven2/org/codehaus/plexus/plexus-java/0.9.2/plexus-java-0.9.2.pom (0 B at 0.0 KB/sec)
Downloading: https://repo.maven.apache.org/maven2/org/codehaus/plexus/plexus-languages/0.9.2/plexus-languages-0.9.2.pom
Downloaded: https://repo.maven.apache.org/maven2/org/codehaus/plexus/plexus-languages/0.9.2/plexus-languages-0.9.2.pom (0 B at 0.0 KB/sec)
Downloading: https://repo.maven.apache.org/maven2/org/ow2/asm/asm/6.0_BETA/asm-6.0_BETA.pom
Downloaded: https://repo.maven.apache.org/maven2/org/ow2/asm/asm/6.0_BETA/asm-6.0_BETA.pom (0 B at 0.0 KB/sec)
Downloading: https://repo.maven.apache.org/maven2/org/ow2/asm/asm-parent/6.0_BETA/asm-parent-6.0_BETA.pom
Downloaded: https://repo.maven.apache.org/maven2/org/ow2/asm/asm-parent/6.0_BETA/asm-parent-6.0_BETA.pom (0 B at 0.0 KB/sec)
Downloading: https://repo.maven.apache.org/maven2/com/thoughtworks/qdox/qdox/2.0-M7/qdox-2.0-M7.pom
Downloaded: https://repo.maven.apache.org/maven2/com/thoughtworks/qdox/qdox/2.0-M7/qdox-2.0-M7.pom (0 B at 0.0 KB/sec)
Downloading: https://repo.maven.apache.org/maven2/org/codehaus/plexus/plexus-compiler-api/2.8.2/plexus-compiler-api-2.8.2.pom
Downloaded: https://repo.maven.apache.org/maven2/org/codehaus/plexus/plexus-compiler-api/2.8.2/plexus-compiler-api-2.8.2.pom (0 B at 0.0 KB/sec)
Downloading: https://repo.maven.apache.org/maven2/org/codehaus/plexus/plexus-compiler/2.8.2/plexus-compiler-2.8.2.pom
Downloaded: https://repo.maven.apache.org/maven2/org/codehaus/plexus/plexus-compiler/2.8.2/plexus-compiler-2.8.2.pom (0 B at 0.0 KB/sec)
Downloading: https://repo.maven.apache.org/maven2/org/codehaus/plexus/plexus-compiler-manager/2.8.2/plexus-compiler-manager-2.8.2.pom
Downloaded: https://repo.maven.apache.org/maven2/org/codehaus/plexus/plexus-compiler-manager/2.8.2/plexus-compiler-manager-2.8.2.pom (0 B at 0.0 KB/sec)
Downloading: https://repo.maven.apache.org/maven2/org/codehaus/plexus/plexus-compiler-javac/2.8.2/plexus-compiler-javac-2.8.2.pom
Downloaded: https://repo.maven.apache.org/maven2/org/codehaus/plexus/plexus-compiler-javac/2.8.2/plexus-compiler-javac-2.8.2.pom (0 B at 0.0 KB/sec)
Downloading: https://repo.maven.apache.org/maven2/org/codehaus/plexus/plexus-compilers/2.8.2/plexus-compilers-2.8.2.pom
Downloaded: https://repo.maven.apache.org/maven2/org/codehaus/plexus/plexus-compilers/2.8.2/plexus-compilers-2.8.2.pom (0 B at 0.0 KB/sec)
Downloading: https://repo.maven.apache.org/maven2/org/codehaus/plexus/plexus-java/0.9.2/plexus-java-0.9.2.jar
Downloading: https://repo.maven.apache.org/maven2/org/ow2/asm/asm/6.0_BETA/asm-6.0_BETA.jar
Downloading: https://repo.maven.apache.org/maven2/com/thoughtworks/qdox/qdox/2.0-M7/qdox-2.0-M7.jar
Downloading: https://repo.maven.apache.org/maven2/org/codehaus/plexus/plexus-compiler-api/2.8.2/plexus-compiler-api-2.8.2.jar
Downloading: https://repo.maven.apache.org/maven2/org/codehaus/plexus/plexus-compiler-manager/2.8.2/plexus-compiler-manager-2.8.2.jar
Downloaded: https://repo.maven.apache.org/maven2/com/thoughtworks/qdox/qdox/2.0-M7/qdox-2.0-M7.jar (0 B at 0.0 KB/sec)
Downloading: https://repo.maven.apache.org/maven2/org/codehaus/plexus/plexus-compiler-javac/2.8.2/plexus-compiler-javac-2.8.2.jar
Downloaded: https://repo.maven.apache.org/maven2/org/ow2/asm/asm/6.0_BETA/asm-6.0_BETA.jar (0 B at 0.0 KB/sec)
Downloaded: https://repo.maven.apache.org/maven2/org/codehaus/plexus/plexus-java/0.9.2/plexus-java-0.9.2.jar (0 B at 0.0 KB/sec)
Downloaded: https://repo.maven.apache.org/maven2/org/codehaus/plexus/plexus-compiler-manager/2.8.2/plexus-compiler-manager-2.8.2.jar (0 B at 0.0 KB/sec)
Downloaded: https://repo.maven.apache.org/maven2/org/codehaus/plexus/plexus-compiler-api/2.8.2/plexus-compiler-api-2.8.2.jar (0 B at 0.0 KB/sec)
Downloaded: https://repo.maven.apache.org/maven2/org/codehaus/plexus/plexus-compiler-javac/2.8.2/plexus-compiler-javac-2.8.2.jar (0 B at 0.0 KB/sec)
[INFO] Changes detected - recompiling the module!
[INFO] Compiling 11 source files to D:\ra\flink-clickhouse-sink-master\target\classes
[INFO] 
[INFO] --- maven-resources-plugin:2.6:testResources (default-testResources) @ flink-clickhouse-sink ---
[INFO] Using 'UTF-8' encoding to copy filtered resources.
[INFO] Copying 2 resources
[INFO] 
[INFO] --- maven-compiler-plugin:3.7.0:testCompile (default-testCompile) @ flink-clickhouse-sink ---
[INFO] Changes detected - recompiling the module!
[INFO] Compiling 3 source files to D:\ra\flink-clickhouse-sink-master\target\test-classes
[INFO] 
[INFO] --- maven-surefire-plugin:2.12.4:test (default-test) @ flink-clickhouse-sink ---
[INFO] Surefire report directory: D:\ra\flink-clickhouse-sink-master\target\surefire-reports

-------------------------------------------------------
 T E S T S
-------------------------------------------------------
Running ru.ivi.opensource.flinkclickhousesink.applied.ClickhouseSinkBufferTest
2020-02-04 17:39:06.413 CST INFO  main r.i.o.f.a.ClickhouseSinkBuffer - Instance Clickhouse Sink, target table = table, buffer size = 100
2020-02-04 17:39:06.553 CST INFO  main r.i.o.f.a.ClickhouseSinkBuffer - Instance Clickhouse Sink, target table = table, buffer size = 100
2020-02-04 17:39:06.764 CST INFO  main r.i.o.f.a.ClickhouseSinkScheduledChecker - Build Sink scheduled checker, timeout (sec) = 2
Tests run: 2, Failures: 0, Errors: 0, Skipped: 0, Time elapsed: 6.548 sec
Running ru.ivi.opensource.flinkclickhousesink.applied.ClickhouseSinkScheduledCheckerTest
2020-02-04 17:39:10.834 CST INFO  main r.i.o.f.a.ClickhouseSinkScheduledChecker - Build Sink scheduled checker, timeout (sec) = 1
0
0
0
0
3
2020-02-04 17:39:11.897 CST INFO  main r.i.o.f.a.ClickhouseSinkScheduledChecker - Build Sink scheduled checker, timeout (sec) = 1
0
0
0
0
4
4
4
4
4
9
Tests run: 2, Failures: 0, Errors: 0, Skipped: 0, Time elapsed: 3.02 sec
Running ru.ivi.opensource.flinkclickhousesink.ClickhouseWriterTest
2020-02-04 17:39:14.619 CST INFO  main o.t.d.DockerClientProviderStrategy - Will use 'okhttp' transport
2020-02-04 17:39:25.242 CST INFO  main o.t.d.DockerClientProviderStrategy - Will use 'okhttp' transport
2020-02-04 17:39:30.325 CST ERROR main o.t.d.DockerClientProviderStrategy - Could not find a valid Docker environment. Please check configuration. Attempted configurations were:
2020-02-04 17:39:30.325 CST ERROR main o.t.d.DockerClientProviderStrategy -     NpipeSocketClientProviderStrategy: failed with exception InvalidConfigurationException (ping failed). Root cause TimeoutException (null)
2020-02-04 17:39:30.325 CST ERROR main o.t.d.DockerClientProviderStrategy -     WindowsClientProviderStrategy: failed with exception TimeoutException (Timeout waiting for result with exception). Root cause ConnectException (Connection refused: connect)
2020-02-04 17:39:30.326 CST ERROR main o.t.d.DockerClientProviderStrategy - As no valid configuration was found, execution cannot continue
Tests run: 1, Failures: 0, Errors: 1, Skipped: 0, Time elapsed: 16.422 sec <<< FAILURE!
highConcurrentTest(ru.ivi.opensource.flinkclickhousesink.ClickhouseWriterTest)  Time elapsed: 0.002 sec  <<< ERROR!
java.lang.IllegalStateException: Could not find a valid Docker environment. Please see logs and check configuration
    at org.testcontainers.dockerclient.DockerClientProviderStrategy.lambda$getFirstValidStrategy$3(DockerClientProviderStrategy.java:157)
    at java.util.Optional.orElseThrow(Optional.java:290)
    at org.testcontainers.dockerclient.DockerClientProviderStrategy.getFirstValidStrategy(DockerClientProviderStrategy.java:149)
    at org.testcontainers.DockerClientFactory.client(DockerClientFactory.java:105)
    at org.testcontainers.containers.GenericContainer.<init>(GenericContainer.java:162)
    at org.testcontainers.containers.JdbcDatabaseContainer.<init>(JdbcDatabaseContainer.java:40)
    at org.testcontainers.containers.ClickHouseContainer.<init>(ClickHouseContainer.java:24)
    at ru.ivi.opensource.flinkclickhousesink.ClickhouseWriterTest.<init>(ClickhouseWriterTest.java:49)
    at sun.reflect.NativeConstructorAccessorImpl.newInstance0(Native Method)
    at sun.reflect.NativeConstructorAccessorImpl.newInstance(NativeConstructorAccessorImpl.java:62)
    at sun.reflect.DelegatingConstructorAccessorImpl.newInstance(DelegatingConstructorAccessorImpl.java:45)
    at java.lang.reflect.Constructor.newInstance(Constructor.java:423)
    at org.junit.runners.BlockJUnit4ClassRunner.createTest(BlockJUnit4ClassRunner.java:217)
    at org.junit.runners.BlockJUnit4ClassRunner$1.runReflectiveCall(BlockJUnit4ClassRunner.java:266)
    at org.junit.internal.runners.model.ReflectiveCallable.run(ReflectiveCallable.java:12)
    at org.junit.runners.BlockJUnit4ClassRunner.methodBlock(BlockJUnit4ClassRunner.java:263)
    at org.junit.runners.BlockJUnit4ClassRunner.runChild(BlockJUnit4ClassRunner.java:78)
    at org.junit.runners.BlockJUnit4ClassRunner.runChild(BlockJUnit4ClassRunner.java:57)
    at org.junit.runners.ParentRunner$3.run(ParentRunner.java:290)
    at org.junit.runners.ParentRunner$1.schedule(ParentRunner.java:71)
    at org.junit.runners.ParentRunner.runChildren(ParentRunner.java:288)
    at org.junit.runners.ParentRunner.access$000(ParentRunner.java:58)
    at org.junit.runners.ParentRunner$2.evaluate(ParentRunner.java:268)
    at org.junit.runners.ParentRunner.run(ParentRunner.java:363)
    at org.apache.maven.surefire.junit4.JUnit4Provider.execute(JUnit4Provider.java:252)
    at org.apache.maven.surefire.junit4.JUnit4Provider.executeTestSet(JUnit4Provider.java:141)
    at org.apache.maven.surefire.junit4.JUnit4Provider.invoke(JUnit4Provider.java:112)
    at sun.reflect.NativeMethodAccessorImpl.invoke0(Native Method)
    at sun.reflect.NativeMethodAccessorImpl.invoke(NativeMethodAccessorImpl.java:62)
    at sun.reflect.DelegatingMethodAccessorImpl.invoke(DelegatingMethodAccessorImpl.java:43)
    at java.lang.reflect.Method.invoke(Method.java:498)
    at org.apache.maven.surefire.util.ReflectionUtils.invokeMethodWithArray(ReflectionUtils.java:189)
    at org.apache.maven.surefire.booter.ProviderFactory$ProviderProxy.invoke(ProviderFactory.java:165)
    at org.apache.maven.surefire.booter.ProviderFactory.invokeProvider(ProviderFactory.java:85)
    at org.apache.maven.surefire.booter.ForkedBooter.runSuitesInProcess(ForkedBooter.java:115)
    at org.apache.maven.surefire.booter.ForkedBooter.main(ForkedBooter.java:75)


Results :

Tests in error: 
  highConcurrentTest(ru.ivi.opensource.flinkclickhousesink.ClickhouseWriterTest): Could not find a valid Docker environment. Please see logs and check configuration

Tests run: 5, Failures: 0, Errors: 1, Skipped: 0

[INFO] ------------------------------------------------------------------------
[INFO] BUILD FAILURE
[INFO] ------------------------------------------------------------------------
[INFO] Total time: 08:40 min
[INFO] Finished at: 2020-02-04T17:39:30+08:00
[INFO] Final Memory: 36M/170M
[INFO] ------------------------------------------------------------------------
[ERROR] Failed to execute goal org.apache.maven.plugins:maven-surefire-plugin:2.12.4:test (default-test) on project flink-clickhouse-sink: There are test failures.
[ERROR] 
[ERROR] Please refer to D:\ra\flink-clickhouse-sink-master\target\surefire-reports for the individual test results.
[ERROR] -> [Help 1]
[ERROR] 
[ERROR] To see the full stack trace of the errors, re-run Maven with the -e switch.
[ERROR] Re-run Maven using the -X switch to enable full debug logging.
[ERROR] 
[ERROR] For more information about the errors and possible solutions, please read the following articles:
[ERROR] [Help 1] http://cwiki.apache.org/confluence/display/MAVEN/MojoFailureException

Process finished with exit code 1
 

加载中
返回顶部
顶部