1
回答
maven编译失败了Could not find artifact jdk.tools:jdk.tools:jar:1.6 at specified path D:\Java/../lib/tools.jar -> [Help 1]

[INFO] Building tensorflow-hadoop 1.0-SNAPSHOT
[INFO] ------------------------------------------------------------------------
[INFO] ------------------------------------------------------------------------
[INFO] BUILD FAILURE
[INFO] ------------------------------------------------------------------------
[INFO] Total time: 0.608 s
[INFO] Finished at: 2017-03-21T16:01:03+08:00
[INFO] Final Memory: 12M/217M
[INFO] ------------------------------------------------------------------------
[ERROR] Failed to execute goal on project tensorflow-hadoop: Could not resolve dependencies for project org.tensorflow:tensorflow-hadoop:jar:1.0-SNAPSHOT: Could not find artifact jdk.tools:jdk.tools:jar:1.6 at specified path D:\Java/../lib/tools.jar -> [Help 1]
[ERROR] 
[ERROR] To see the full stack trace of the errors, re-run Maven with the -e switch.
[ERROR] Re-run Maven using the -X switch to enable full debug logging.
[ERROR] 
[ERROR] For more information about the errors and possible solutions, please read the following articles:
[ERROR] [Help 1] http://cwiki.apache.org/confluence/display/MAVEN/DependencyResolutionException

举报
顶部