c编译 gcc问题 没搞过啊!求帮助 急

SandKing 发布于 2013/10/10 09:32
阅读 7K+
收藏 0
checking for a BSD-compatible install... /usr/bin/install -c
checking whether build environment is sane... yes
checking for a thread-safe mkdir -p... ./install-sh -c -d
checking for gawk... no
checking for mawk... no
checking for nawk... no
checking for awk... awk
checking whether make sets $(MAKE)... yes
checking build system type... x86_64-apple-darwin11.4.0d1
checking host system type... x86_64-apple-darwin11.4.0d1
checking for gcc... gcc
checking whether the C compiler works... no
configure: error: in `/Users/niko/memcachedbuild/libevent-1.4.14-stable':
configure: error: C compiler cannot create executables
See `config.log' for more details.


config.log文件内容如下

This file contains any messages produced by compilers while
running configure, to aid debugging if configure makes a mistake.


It was created by configure, which was
generated by GNU Autoconf 2.65.  Invocation command line was


  $ ./configure 


## --------- ##
## Platform. ##
## --------- ##


hostname = Macintosh.local
uname -m = i386
uname -r = 11.4.0d1
uname -s = Darwin
uname -v = Darwin Kernel Version 11.4.0d1: Fri May 18 16:05:31 EDT 2012; root:xnu-1699.26.8/BUILD/obj//RELEASE_I386


/usr/bin/uname -p = i386
/bin/uname -X     = unknown


/bin/arch              = unknown
/usr/bin/arch -k       = unknown
/usr/convex/getsysinfo = unknown
/usr/bin/hostinfo      = Mach kernel version:
Darwin Kernel Version 11.4.0d1: Fri May 18 16:05:31 EDT 2012; root:xnu-1699.26.8/BUILD/obj//RELEASE_I386
Kernel configured for up to 4 processors.
4 processors are physically available.
4 processors are logically available.
Processor type: i486 (Intel 80486)
Processors active: 0 1 2 3
Primary memory available: 16.00 gigabytes
Default processor set: 92 tasks, 411 threads, 4 processors
Load average: 0.71, Mach factor: 3.28
/bin/machine           = unknown
/usr/bin/oslevel       = unknown
/bin/universe          = unknown


PATH: /usr/bin
PATH: /bin
PATH: /usr/sbin
PATH: /sbin
PATH: /usr/local/bin
PATH: /usr/X11/bin




## ----------- ##
## Core tests. ##
## ----------- ##


configure:2569: checking for a BSD-compatible install
configure:2637: result: /usr/bin/install -c
configure:2648: checking whether build environment is sane
configure:2698: result: yes
configure:2839: checking for a thread-safe mkdir -p
configure:2878: result: ./install-sh -c -d
configure:2891: checking for gawk
configure:2921: result: no
configure:2891: checking for mawk
configure:2921: result: no
configure:2891: checking for nawk
configure:2921: result: no
configure:2891: checking for awk
configure:2907: found /usr/bin/awk
configure:2918: result: awk
configure:2929: checking whether make sets $(MAKE)
configure:2951: result: yes
configure:3038: checking build system type
configure:3052: result: x86_64-apple-darwin11.4.0d1
configure:3072: checking host system type
configure:3085: result: x86_64-apple-darwin11.4.0d1
configure:3162: checking for gcc
configure:3178: found /usr/bin/gcc
configure:3189: result: gcc
configure:3418: checking for C compiler version
configure:3427: gcc --version >&5
i686-apple-darwin11-llvm-gcc-4.2 (GCC) 4.2.1 (Based on Apple Inc. build 5658) (LLVM build 2336.11.00)
Copyright (C) 2007 Free Software Foundation, Inc.
This is free software; see the source for copying conditions.  There is NO
warranty; not even for MERCHANTABILITY or FITNESS FOR A PARTICULAR PURPOSE.


configure:3438: $? = 0
configure:3427: gcc -v >&5
Using built-in specs.
Target: i686-apple-darwin11
Configured with: /private/var/tmp/llvmgcc42/llvmgcc42-2336.11~182/src/configure --disable-checking --enable-werror --prefix=/Applications/Xcode.app/Contents/Developer/usr/llvm-gcc-4.2 --mandir=/share/man --enable-languages=c,objc,c++,obj-c++ --program-prefix=llvm- --program-transform-name=/^[cg][^.-]*$/s/$/-4.2/ --with-slibdir=/usr/lib --build=i686-apple-darwin11 --enable-llvm=/private/var/tmp/llvmgcc42/llvmgcc42-2336.11~182/dst-llvmCore/Developer/usr/local --program-prefix=i686-apple-darwin11- --host=x86_64-apple-darwin11 --target=i686-apple-darwin11 --with-gxx-include-dir=/usr/include/c++/4.2.1
Thread model: posix
gcc version 4.2.1 (Based on Apple Inc. build 5658) (LLVM build 2336.11.00)
configure:3438: $? = 0
configure:3427: gcc -V >&5
llvm-gcc-4.2: argument to `-V' is missing
configure:3438: $? = 1
configure:3427: gcc -qversion >&5
i686-apple-darwin11-llvm-gcc-4.2: no input files
configure:3438: $? = 1
configure:3458: checking whether the C compiler works
configure:3480: gcc    conftest.c  >&5
ld: malformed 32-bit x.y.z version number: 11.4.0d1
collect2: ld returned 1 exit status
configure:3484: $? = 1
configure:3522: result: no
configure: failed program was:
| /* confdefs.h */
| #define PACKAGE_NAME ""
| #define PACKAGE_TARNAME ""
| #define PACKAGE_VERSION ""
| #define PACKAGE_STRING ""
| #define PACKAGE_BUGREPORT ""
| #define PACKAGE_URL ""
| #define PACKAGE "libevent"
| #define VERSION "1.4.14-stable"
| #define NUMERIC_VERSION 0x01040e00
| /* end confdefs.h.  */

| int
| main ()
| {

|   ;
|   return 0;
| }
configure:3527: error: in `/Users/niko/memcachedbuild/libevent-1.4.14-stable':
configure:3531: error: C compiler cannot create executables
See `config.log' for more details.


## ---------------- ##
## Cache variables. ##
## ---------------- ##


ac_cv_build=x86_64-apple-darwin11.4.0d1
ac_cv_env_CC_set=
ac_cv_env_CC_value=
ac_cv_env_CFLAGS_set=
ac_cv_env_CFLAGS_value=
ac_cv_env_CPPFLAGS_set=
ac_cv_env_CPPFLAGS_value=
ac_cv_env_CPP_set=
ac_cv_env_CPP_value=
ac_cv_env_LDFLAGS_set=
ac_cv_env_LDFLAGS_value=
ac_cv_env_LIBS_set=
ac_cv_env_LIBS_value=
ac_cv_env_build_alias_set=
ac_cv_env_build_alias_value=
ac_cv_env_host_alias_set=
ac_cv_env_host_alias_value=
ac_cv_env_target_alias_set=
ac_cv_env_target_alias_value=
ac_cv_host=x86_64-apple-darwin11.4.0d1
ac_cv_path_install='/usr/bin/install -c'
ac_cv_prog_AWK=awk
ac_cv_prog_ac_ct_CC=gcc
ac_cv_prog_make_make_set=yes


## ----------------- ##
## Output variables. ##
## ----------------- ##


ACLOCAL='${SHELL} /Users/niko/memcachedbuild/libevent-1.4.14-stable/missing --run aclocal-1.11'
AMDEPBACKSLASH=''
AMDEP_FALSE=''
AMDEP_TRUE=''
AMTAR='${SHELL} /Users/niko/memcachedbuild/libevent-1.4.14-stable/missing --run tar'
AR=''
AUTOCONF='${SHELL} /Users/niko/memcachedbuild/libevent-1.4.14-stable/missing --run autoconf'
AUTOHEADER='${SHELL} /Users/niko/memcachedbuild/libevent-1.4.14-stable/missing --run autoheader'
AUTOMAKE='${SHELL} /Users/niko/memcachedbuild/libevent-1.4.14-stable/missing --run automake-1.11'
AWK='awk'
BUILD_WIN32_FALSE=''
BUILD_WIN32_TRUE=''
CC='gcc'
CCDEPMODE=''
CFLAGS=''
CPP=''
CPPFLAGS=''
CYGPATH_W='echo'
DEFS=''
DEPDIR=''
DSYMUTIL=''
DUMPBIN=''
ECHO_C='\c'
ECHO_N=''
ECHO_T=''
EGREP=''
EXEEXT=''
FGREP=''
GREP=''
INSTALL_DATA='${INSTALL} -m 644'
INSTALL_PROGRAM='${INSTALL}'
INSTALL_SCRIPT='${INSTALL}'
INSTALL_STRIP_PROGRAM='$(install_sh) -c -s'
LD=''
LDFLAGS=''
LIBOBJS=''
LIBS=''
LIBTOOL=''
LIBTOOL_DEPS=''
LIPO=''
LN_S=''
LTLIBOBJS=''
MAKEINFO='${SHELL} /Users/niko/memcachedbuild/libevent-1.4.14-stable/missing --run makeinfo'
MKDIR_P='./install-sh -c -d'
NM=''
NMEDIT=''
OBJDUMP=''
OBJEXT=''
OTOOL64=''
OTOOL=''
PACKAGE='libevent'
PACKAGE_BUGREPORT=''
PACKAGE_NAME=''
PACKAGE_STRING=''
PACKAGE_TARNAME=''
PACKAGE_URL=''
PACKAGE_VERSION=''
PATH_SEPARATOR=':'
RANLIB=''
SED=''
SET_MAKE=''
SHELL='/bin/sh'
STRIP=''
VERSION='1.4.14-stable'
ac_ct_CC='gcc'
ac_ct_DUMPBIN=''
am__EXEEXT_FALSE=''
am__EXEEXT_TRUE=''
am__fastdepCC_FALSE=''
am__fastdepCC_TRUE=''
am__include=''
am__isrc=''
am__leading_dot='.'
am__quote=''
am__tar='${AMTAR} chof - "$$tardir"'
am__untar='${AMTAR} xf -'
bindir='${exec_prefix}/bin'
build='x86_64-apple-darwin11.4.0d1'
build_alias=''
build_cpu='x86_64'
build_os='darwin11.4.0d1'
build_vendor='apple'
datadir='${datarootdir}'
datarootdir='${prefix}/share'
docdir='${datarootdir}/doc/${PACKAGE}'
dvidir='${docdir}'
exec_prefix='NONE'
host='x86_64-apple-darwin11.4.0d1'
host_alias=''
host_cpu='x86_64'
host_os='darwin11.4.0d1'
host_vendor='apple'
htmldir='${docdir}'
includedir='${prefix}/include'
infodir='${datarootdir}/info'
install_sh='${SHELL} /Users/niko/memcachedbuild/libevent-1.4.14-stable/install-sh'
libdir='${exec_prefix}/lib'
libexecdir='${exec_prefix}/libexec'
localedir='${datarootdir}/locale'
localstatedir='${prefix}/var'
lt_ECHO='/bin/echo'
mandir='${datarootdir}/man'
mkdir_p='$(top_builddir)/./install-sh -c -d'
oldincludedir='/usr/include'
pdfdir='${docdir}'
prefix='/usr/local'
program_transform_name='s,x,x,'
psdir='${docdir}'
sbindir='${exec_prefix}/sbin'
sharedstatedir='${prefix}/com'
sysconfdir='${prefix}/etc'
target_alias=''


## ----------- ##
## confdefs.h. ##
## ----------- ##


/* confdefs.h */
#define PACKAGE_NAME ""
#define PACKAGE_TARNAME ""
#define PACKAGE_VERSION ""
#define PACKAGE_STRING ""
#define PACKAGE_BUGREPORT ""
#define PACKAGE_URL ""
#define PACKAGE "libevent"
#define VERSION "1.4.14-stable"
#define NUMERIC_VERSION 0x01040e00


configure: exit 77


加载中
0
horst_hu
horst_hu
看一下config.log,可能会找到答案
SandKing
SandKing
config.log 已经贴上来了!没看懂!
0
SandKing
SandKing
求大虾们看看啊
0
coolee
coolee

checking whether the C compiler works... no 

感觉重点是这一句, 查查什么原因吧

返回顶部
顶部