开源中国 Android 客户端 v2.8.6 发布

2017年06月05日

这个美好的六月,开源中国源创会童鞋们马不停蹄地赶往杭州,因为「毕竟西湖六月中,风光不与四时同」,带着自由、开放、分享的开源精神和大家一起分享、交流,是何等惬意的事情呢!杭州附近的童鞋,请猛击这里报名哦!除了各种干货之外,还有众多奖品等着你!

当然,客户端童鞋们也没有闲着哦!今天我们非常高兴的宣布:开源中国 Android 客户端 v2.8.6 版本正式发布!

横屏阅码,怎一个「爽」字了得

收到许多OSCer反馈说,在「码云推荐」项目中查阅源代码时很不舒服。因此,这个版本中我们加入了横屏阅读源码的辅助功能。在阅读源码时,只需将手机横向转动即可。

全新的升级检测及界面,更好的适配 Android 7

鉴于很多OSCer童鞋已经升级到各种不同的Android 7/7.1 版本,我们也对该版本进行了一定的适配,尤其在读写存储方面进行了一定的改进。当然,我们也没有忘记改进升级策略和界面,请看:

其他常见问题修复

此外,我们也对上个版本中OSCer们给我们的反馈(eg:华为部分进行右上角会出现白色菜单栏)进行了适当的处理。

~~~~~~~~~~~~~~~~~~~~

请扫描如下二维码或点击这里下载最新版客户端


不要再犹豫了,赶紧拿起手中的设备升级吧!

顺便说一下,v2.8.6 版本源码将会在明天正式开源,敬请各位OSCer期待!

大家都知道,开源中国秉承自由、开放、分享的精神,每次客户端升级之后代码都会在第一时间开源,以供大家查阅、学习、批评、指正。所以,遇到有问题或更好的建议时,请大家通过码云issue来向我们反馈。

开源中国客户端 Android 版码云源码请访问: http://git.oschina.net/oschina/android-app


展开阅读全文
6 收藏
分享
加载中
最新评论 (23)

引用来自“飞刀6895242”的评论

环境和官方所列的一样,出现以下问题:
C:\Users\Administrator\Desktop\android-app\app\src\main\java\net\oschina\app\improve\detail\db\API.java
Error:(19, 49) 错误: 找不到符号
符号: 变量 VIOLET_PASSCODE
位置: 类 BuildConfig
Error:Execution failed for task ':app:compileOschinaReleaseJavaWithJavac'.
> Compilation failed; see the compiler error output for details.
Information:BUILD FAILED
Information:Gradle tasks [:app:assembleOschinaRelease]

引用来自“不务正业的程序员”的评论

兄弟,我也是找不到变量变量 VIOLET_PASSCODE,你是怎么解决的?

引用来自“yanhs”的评论

手工加上,在 buildConfigField("String", "API_SERVER_URL", 这行的下面
回复@yanhs : value 写啥
2018-05-25 13:58
0
回复
举报

引用来自“飞刀6895242”的评论

环境和官方所列的一样,出现以下问题:
C:\Users\Administrator\Desktop\android-app\app\src\main\java\net\oschina\app\improve\detail\db\API.java
Error:(19, 49) 错误: 找不到符号
符号: 变量 VIOLET_PASSCODE
位置: 类 BuildConfig
Error:Execution failed for task ':app:compileOschinaReleaseJavaWithJavac'.
> Compilation failed; see the compiler error output for details.
Information:BUILD FAILED
Information:Gradle tasks [:app:assembleOschinaRelease]

引用来自“不务正业的程序员”的评论

兄弟,我也是找不到变量变量 VIOLET_PASSCODE,你是怎么解决的?

引用来自“yanhs”的评论

手工加上,在 buildConfigField("String", "API_SERVER_URL", 这行的下面

引用来自“supercoeus”的评论

找不到符号 变量 VIOLET_PASSCODE 怎么解决的呢?
还是没有明白怎么解决,能说的详细一些吗?谢谢了
2017-10-31 21:02
0
回复
举报

引用来自“飞刀6895242”的评论

环境和官方所列的一样,出现以下问题:
C:\Users\Administrator\Desktop\android-app\app\src\main\java\net\oschina\app\improve\detail\db\API.java
Error:(19, 49) 错误: 找不到符号
符号: 变量 VIOLET_PASSCODE
位置: 类 BuildConfig
Error:Execution failed for task ':app:compileOschinaReleaseJavaWithJavac'.
> Compilation failed; see the compiler error output for details.
Information:BUILD FAILED
Information:Gradle tasks [:app:assembleOschinaRelease]

引用来自“不务正业的程序员”的评论

兄弟,我也是找不到变量变量 VIOLET_PASSCODE,你是怎么解决的?

引用来自“yanhs”的评论

手工加上,在 buildConfigField("String", "API_SERVER_URL", 这行的下面
找不到符号 变量 VIOLET_PASSCODE 怎么解决的呢?
2017-08-09 11:31
0
回复
举报

引用来自“飞刀6895242”的评论

环境和官方所列的一样,出现以下问题:
C:\Users\Administrator\Desktop\android-app\app\src\main\java\net\oschina\app\improve\detail\db\API.java
Error:(19, 49) 错误: 找不到符号
符号: 变量 VIOLET_PASSCODE
位置: 类 BuildConfig
Error:Execution failed for task ':app:compileOschinaReleaseJavaWithJavac'.
> Compilation failed; see the compiler error output for details.
Information:BUILD FAILED
Information:Gradle tasks [:app:assembleOschinaRelease]

引用来自“不务正业的程序员”的评论

兄弟,我也是找不到变量变量 VIOLET_PASSCODE,你是怎么解决的?
手工加上,在 buildConfigField("String", "API_SERVER_URL", 这行的下面
2017-08-03 12:22
0
回复
举报
V2.8.6报错
Error:Unable to load class 'org.gradle.logging.StyledTextOutput$Style'.
Possible causes for this unexpected error include:<ul><li>Gradle's dependency cache may be corrupt (this sometimes occurs after a network connection timeout.)
<a href="syncProject">Re-download dependencies and sync project (requires network)</a></li><li>The state of a Gradle build process (daemon) may be corrupt. Stopping all Gradle daemons may solve this problem.
<a href="stopGradleDaemons">Stop Gradle build processes (requires restart)</a></li><li>Your project may be using a third-party plugin which is not compatible with the other plugins in the project or the version of Gradle requested by the project.</li></ul>In the case of corrupt Gradle processes, you can also try closing the IDE and then killing all Java processes.
解决办法:升级dexcount到0.7.1
2017-07-07 08:50
0
回复
举报

引用来自“飞刀6895242”的评论

环境和官方所列的一样,出现以下问题:
C:\Users\Administrator\Desktop\android-app\app\src\main\java\net\oschina\app\improve\detail\db\API.java
Error:(19, 49) 错误: 找不到符号
符号: 变量 VIOLET_PASSCODE
位置: 类 BuildConfig
Error:Execution failed for task ':app:compileOschinaReleaseJavaWithJavac'.
> Compilation failed; see the compiler error output for details.
Information:BUILD FAILED
Information:Gradle tasks [:app:assembleOschinaRelease]
兄弟,我也是找不到变量变量 VIOLET_PASSCODE,你是怎么解决的?
2017-06-22 09:41
0
回复
举报
请大神给出会员注册,登陆的返回JSOn数据样示
2017-06-16 12:13
0
回复
举报

引用来自“飞刀6895242”的评论

环境和官方所列的一样,出现以下问题:
C:\Users\Administrator\Desktop\android-app\app\src\main\java\net\oschina\app\improve\detail\db\API.java
Error:(19, 49) 错误: 找不到符号
符号: 变量 VIOLET_PASSCODE
位置: 类 BuildConfig
Error:Execution failed for task ':app:compileOschinaReleaseJavaWithJavac'.
> Compilation failed; see the compiler error output for details.
Information:BUILD FAILED
Information:Gradle tasks [:app:assembleOschinaRelease]

引用来自“飞刀6895242”的评论

回复@飞刀6895242 : Android Studio = 2.3.3 Gradel Version: 2.14.1 Gradle Plugin Version: 2.2.3 SDK Tool = 24.0.3
回复@飞刀6895242 : v2.8.5(1705031527)编译成功
2017-06-12 13:09
0
回复
举报

引用来自“飞刀6895242”的评论

环境和官方所列的一样,出现以下问题:
C:\Users\Administrator\Desktop\android-app\app\src\main\java\net\oschina\app\improve\detail\db\API.java
Error:(19, 49) 错误: 找不到符号
符号: 变量 VIOLET_PASSCODE
位置: 类 BuildConfig
Error:Execution failed for task ':app:compileOschinaReleaseJavaWithJavac'.
> Compilation failed; see the compiler error output for details.
Information:BUILD FAILED
Information:Gradle tasks [:app:assembleOschinaRelease]
回复@飞刀6895242 : Android Studio = 2.3.3 Gradel Version: 2.14.1 Gradle Plugin Version: 2.2.3 SDK Tool = 24.0.3
2017-06-12 12:01
0
回复
举报
环境和官方所列的一样,出现以下问题:
C:\Users\Administrator\Desktop\android-app\app\src\main\java\net\oschina\app\improve\detail\db\API.java
Error:(19, 49) 错误: 找不到符号
符号: 变量 VIOLET_PASSCODE
位置: 类 BuildConfig
Error:Execution failed for task ':app:compileOschinaReleaseJavaWithJavac'.
> Compilation failed; see the compiler error output for details.
Information:BUILD FAILED
Information:Gradle tasks [:app:assembleOschinaRelease]
2017-06-12 11:24
0
回复
举报
更多评论
23 评论
6 收藏
分享
返回顶部
顶部