[error] failed to execute goal org.apache.maven.plugins:maven-surefire-plugi

加载中

Failed to execute goal org.apache.maven.plugins:maven-compiler-plugi

https://www.oschina.net/question/1991666_2233483

Failed to execute goal org.apache.maven.plugins:maven-compiler-plugin:3.1:compile (default-compile) on project mlib: Compilation failure [ERROR] No compiler is provided in this ...

2017/03/06 00:00

maven Failed to execute goal org.apache.maven.plugins:maven-surefire-plugin:2.12.4

https://my.oschina.net/u/4316056/blog/4002467

maven Failed to execute goal org.apache.maven.plugins:maven-surefire-plugin:2.12.4 CreateTime--2018年4月19日17:40:06 Author:Marydon 1.异常明细: [ERROR] Failed to execute goal o...

2018/04/19 00:00

maven打包报错:Failed to execute goal org.apache.maven.plugins:maven-surefire-plugin:2.5:test

https://my.oschina.net/u/141726/blog/407618

mvn compile 没有问题,mvn package的时候报如下错误: Failed to execute goal org.apache.maven.plugins:maven-surefire-plugin:2.5:test 解决方法: 打包跳过测试有两种方法 一是命令行,...

2015/04/29 00:00

Failed to execute goal org.apache.maven.plugins

https://my.oschina.net/u/1272080/blog/374683

Maven部署打包安装的时候,即执行mvn clean install -DskipTests的时候, 出现类似下面的异常: Failed to execute goalorg.apache.maven.plugins:maven-antrun-plugin:1.7:XX ,An AntBui...

2015/02/03 00:00

mvn clean package Failed to execute goal org.apache.maven.plugins:maven-surefire-plugin:2.22.2:test

https://my.oschina.net/u/4146651/blog/4365779

maven 工程执行 mvn clean package 命令出错: [ERROR] Failed to execute goal org.apache.maven.plugins:maven-surefire-plugin:2.22.2:test (default-test) on project eureka-server: T...

2020/07/13 00:00

maven打包遇到错误,Failed to execute goal org.apache.maven.plugins:maven-surefire-plugin:2.22.1:test

https://my.oschina.net/u/4415923/blog/3336811

对Pom文件进行配置(亲自尝试,已成功解决)

2019/12/02 00:00

maven install时报错Failed to execute goal org.apache.maven.plugins:maven-surefire-plugin:2.12.4:test

https://my.oschina.net/u/3139290/blog/4304859

写入pom文件,

2020/06/09 00:00

Failed to execute goal org.apache.maven.plugins:maven-compiler-plugin:3.1:

https://www.oschina.net/question/1991666_2268056

BUILD FAILURE [INFO] ------------------------------------------------------------------------ [INFO] Total time: 0.959 s [INFO] Finished at: 2017-10-17T17:29:50+08:00 [INFO] Fin...

2017/10/17 00:00

Maven Failed to execute goal org.apache.maven.plugins:maven-clean-plugin

https://www.oschina.net/question/554168_132655

项目执行clean的时候出现如下的错误: 但是不知道具体错误在哪里?但是target目录下的文件全部成功删除了。

2013/11/12 00:00

[ERROR] Failed to execute goal org.apache.maven.plugins:maven-compiler-plugin:3.1:compile (defaul...

https://my.oschina.net/u/4340671/blog/3941096

[ERROR] Failed to execute goal org.apache.maven.plugins:maven-compiler-plugin:3.1:compile (default-compile) on project triage: Compilation failure [ERROR] No compiler is provide...

2018/06/11 00:00

springboot Failed to execute goal org.apache.maven.plugins:maven-surefire-plugin:2.22.2:test (def...

https://my.oschina.net/u/4383937/blog/4297908

springboot Failed to execute goal org.apache.maven.plugins:maven-surefire-plugin:2.22.2:test (default-test) on project springboot-mybatis: There are test failures. springboot创建...

2020/06/01 00:00

[ERROR] Failed to execute goal org.apache.maven.plugins:maven-war-plugin:2.1.1:war

https://my.oschina.net/u/4335884/blog/3367900

创建springboot项目,且不采用引入springboot时,pom.xml如下: com.exampledemo-with

2019/10/19 00:00

[ERROR] Failed to execute goal org.apache.maven.plugins:maven-assembly-plugin:2.4:single (make-as...

https://my.oschina.net/u/4279212/blog/3989855

自己在使用maven进行package操作时出现[ERROR] Failed to execute goal org.apache.maven.plugins:maven-assembly-plugin:2.4:single (make-assembly) on project hive-udf: Error reading a...

2018/04/30 00:00

Failed to execute goal org.apache.maven.plugins:ma

https://my.oschina.net/u/1859350/blog/522775

把eclipse或其他地方的jre目录改成jdk 的

2015/10/27 00:00

Failed to execute goal org.apache.maven.plugins:ma

https://my.oschina.net/u/567296/blog/474273

开发中一个项目很早就报这个错,maven报错非法字符:65279 错误,今天终于忍无可忍要解决它 :编译java 文件的时候,有些java文件报非法字符 65279错误,在网上找和很多 方法,也试了很多方法...

2015/07/03 00:00

Failed to execute goal org.apache.maven.plugins:ma

https://my.oschina.net/u/1378869/blog/210191

Failed to execute goal org.apache.maven.plugins:maven-compiler-plugin:2.5.1: 这个应该是编译出错,我把pom.xml删了重新下载一遍就好了。...

2014/03/21 00:00

Maven 构建错误:Failed to execute goal org.apache.maven.plugins:maven-compiler-plugin

https://my.oschina.net/u/2424989/blog/3044300

Maven 构建错误:Failed to execute goal org.apache.maven.plugins:maven-compiler-plugin 原因是 java jdk版本问题或者eclipse JREs 中只有jre没有jdk ,查看eclipse preferences-->java-->...

2019/04/30 00:00

[ERROR] Failed to execute goal org.apache.maven.plugins:maven-war-plugin:2.2:war (default-war) on...

https://my.oschina.net/u/4411208/blog/4015368

maven打包成war时,报错: [ERROR] Failed to execute goal org.apache.maven.plugins:maven-war-plugin:2.2:war (default-war) on project child02: Error assembling WAR: webxml attribute...

2018/04/09 00:00

报错:Failed to execute goal org.apache.maven.plugins:maven-compiler-plugin:3.1

https://my.oschina.net/u/4287161/blog/3623061

报错现象: Eclipse:Failed to execute goal org.apache.maven.plugins:maven-compiler-plugin:3.1:compile (default-compile) on project bigdata.kafkaTest: Compilation failure: Compil...

2019/03/07 00:00
返回顶部
顶部